{"text_format":"1","workbook":"xlsx","n_sheets":3,"sheets":["Sheet1","Sheet2","Sheet3"],"not_rendered":{"charts":0,"images":0,"macros":1,"external_links":0,"defined_names":2,"comments":0,"pivot_tables":0},"unopened":[],"bounds":{"document_bytes":16777216,"sheet_cells":100000,"rows_first":2000,"rows_last":500,"rows_between":2000,"halvings":0,"cell_chars":16384,"cell_head_chars":4096},"cells_cut":0,"cells_raw":0,"read":"whole","date_system":"1900"}

{"sheet":"Sheet1","index":0,"n_rows":368,"n_cols":24,"rows_kept":368,"cut":false,"hidden":false,"merged":[[185,0,185,11],[197,3,197,11],[186,3,186,11],[187,3,187,11],[188,3,188,11],[189,3,189,11],[190,3,190,11],[191,3,191,11],[192,3,192,11],[193,3,193,11],[194,3,194,11],[195,3,195,11],[196,3,196,11],[204,3,204,11],[205,3,205,11],[206,3,206,11],[198,3,198,11],[199,3,199,11],[200,3,200,11],[201,3,201,11],[202,3,202,11],[203,3,203,11],[212,3,212,11],[213,3,213,11],[214,3,214,11],[215,3,215,11],[216,3,216,11],[207,3,207,11],[208,3,208,11],[209,3,209,11],[210,3,210,11],[211,3,211,11],[222,3,222,11],[223,3,223,11],[224,3,224,11],[225,3,225,11],[226,3,226,11],[217,3,217,11],[218,3,218,11],[219,3,219,11],[220,3,220,11],[221,3,221,11],[232,3,232,11],[233,3,233,11],[234,3,234,11],[235,3,235,11],[236,3,236,11],[227,3,227,11],[228,3,228,11],[229,3,229,11],[230,3,230,11],[231,3,231,11],[242,3,242,11],[243,3,243,11],[244,3,244,11],[245,3,245,11],[246,3,246,11],[237,3,237,11],[238,3,238,11],[239,3,239,11],[240,3,240,11],[241,3,241,11],[252,3,252,11],[253,3,253,11],[254,3,254,11],[255,3,255,11],[256,3,256,11],[247,3,247,11],[248,3,248,11],[249,3,249,11],[250,3,250,11],[251,3,251,11],[262,3,262,11],[263,3,263,11],[264,3,264,11],[265,3,265,11],[266,3,266,11],[257,3,257,11],[258,3,258,11],[259,3,259,11],[260,3,260,11],[261,3,261,11],[272,3,272,11],[273,3,273,11],[274,3,274,11],[275,3,275,11],[276,3,276,11],[267,3,267,11],[268,3,268,11],[269,3,269,11],[270,3,270,11],[271,3,271,11],[282,3,282,11],[283,3,283,11],[284,3,284,11],[285,3,285,11],[286,3,286,11],[277,3,277,11],[278,3,278,11],[279,3,279,11],[280,3,280,11],[281,3,281,11],[292,3,292,11],[293,3,293,11],[294,3,294,11],[295,3,295,11],[296,3,296,11],[287,3,287,11],[288,3,288,11],[289,3,289,11],[290,3,290,11],[291,3,291,11],[302,3,302,11],[303,3,303,11],[304,3,304,11],[305,3,305,11],[306,3,306,11],[297,3,297,11],[298,3,298,11],[299,3,299,11],[300,3,300,11],[301,3,301,11],[312,3,312,11],[313,3,313,11],[314,3,314,11],[315,3,315,11],[316,3,316,11],[307,3,307,11],[308,3,308,11],[309,3,309,11],[310,3,310,11],[311,3,311,11],[322,3,322,11],[323,3,323,11],[324,3,324,11],[325,3,325,11],[326,3,326,11],[317,3,317,11],[318,3,318,11],[319,3,319,11],[320,3,320,11],[321,3,321,11],[332,3,332,11],[333,3,333,11],[334,3,334,11],[335,3,335,11],[336,3,336,11],[327,3,327,11],[328,3,328,11],[329,3,329,11],[330,3,330,11],[331,3,331,11],[342,3,342,11],[343,3,343,11],[344,3,344,11],[345,3,345,11],[346,3,346,11],[337,3,337,11],[338,3,338,11],[339,3,339,11],[340,3,340,11],[341,3,341,11],[352,3,352,11],[353,3,353,11],[354,3,354,11],[355,3,355,11],[356,3,356,11],[347,3,347,11],[348,3,348,11],[349,3,349,11],[350,3,350,11],[351,3,351,11],[367,3,367,11],[362,3,362,11],[363,3,363,11],[364,3,364,11],[365,3,365,11],[366,3,366,11],[357,3,357,11],[358,3,358,11],[359,3,359,11],[360,3,360,11],[361,3,361,11]]}
[null,"Last Name","First Name","Pretest Score","Validation1","Pretest Percentage","Pretest Growth Target Score","Post Test Score",null,"Post Test Percentage","Post Test Growth Target Score","Post Test Target Percentage","(1 or 0) Pretest Taken","(1 or 0) Post Test Taken","Took Pre and Post Test","Score Counted for Data","count if \"yes\"","(counts K, L, O) Both Tests Taken and Counted","Counts Target Met","counts P and Q","Target Met?"]
[1,null,null,null,{"$f":"IF(D2>$W$3,InvalidPretestScore())","v":false},{"$f":"(D2/$W$3)","v":{"$error":"#DIV/0!"}},{"$f":"(($W$3-D2)/2)+D2","v":0},null,{"$f":"IF(H2>$W$4,InvalidPosttestScore())","v":false},{"$f":"H2/$W$4","v":{"$error":"#DIV/0!"}},{"$f":"L2*$W$4","v":{"$error":"#DIV/0!"}},{"$f":"G2/$W$3","v":{"$error":"#DIV/0!"}},{"$f":"IF(D2 = 0, 0,1)","v":0},{"$f":"IF(H2 = 0, 0,1)","v":0},{"$f":"SUM(M2,N2)","v":0},"YES",{"$f":"COUNTIF(P2,\"=YES\")","v":1},{"$f":"SUM(M2:N2,Q2)","v":1},{"$f":"COUNTIF(U2,\"=yes\")","v":0},{"$f":"SUM(R2,S2)","v":1},{"$f":"IF(AND(J2>=L2),\"YES\",IF(AND(J2<L2,J2>=1%),\"NO\",IF(AND(J2=0%),\"INVALID\")))","v":{"$error":"#DIV/0!"}},"Teacher",null,"YES"]
[2,null,null,null,{"$f":"IF(D3>$W$3,InvalidPretestScore())","v":false},{"$f":"(D3/$W$3)","v":{"$error":"#DIV/0!"}},0,null,{"$f":"IF(H3>$W$4,InvalidPosttestScore())","v":false},{"$error":"#DIV/0!"},{"$error":"#DIV/0!"},{"$error":"#DIV/0!"},{"$f":"IF(D3 = 0, 0,1)","v":0},{"$f":"IF(H3 = 0, 0,1)","v":0},{"$f":"SUM(M3,N3)","v":0},"YES",{"$f":"COUNTIF(P3,\"=YES\")","v":1},1,{"$f":"COUNTIF(U3,\"=yes\")","v":0},{"$f":"SUM(R3,S3)","v":1},{"$error":"#DIV/0!"},"Pretest Points Possible",null,"NO"]
[3,null,null,null,{"$f":"IF(D4>$W$3,InvalidPretestScore())","v":false},{"$error":"#DIV/0!"},0,null,{"$f":"IF(H4>$W$4,InvalidPosttestScore())","v":false},{"$error":"#DIV/0!"},{"$error":"#DIV/0!"},{"$error":"#DIV/0!"},0,0,0,"YES",1,1,{"$f":"COUNTIF(U4,\"=yes\")","v":0},1,{"$error":"#DIV/0!"},"Posttest Points Possible"]
[4,null,null,null,{"$f":"IF(D5>$W$3,InvalidPretestScore())","v":false},{"$error":"#DIV/0!"},0,null,{"$f":"IF(H5>$W$4,InvalidPosttestScore())","v":false},{"$error":"#DIV/0!"},{"$error":"#DIV/0!"},{"$error":"#DIV/0!"},0,0,0,"YES",1,1,{"$f":"COUNTIF(U5,\"=yes\")","v":0},1,{"$error":"#DIV/0!"},"Total Tested (Pre&Post)",{"$f":"COUNTIF(O2:O181,\"=2\")","v":0}]
[5,null,null,null,{"$f":"IF(D6>$W$3,InvalidPretestScore())","v":false},{"$error":"#DIV/0!"},0,null,{"$f":"IF(H6>$W$4,InvalidPosttestScore())","v":false},{"$error":"#DIV/0!"},{"$error":"#DIV/0!"},{"$error":"#DIV/0!"},0,0,0,"YES",1,1,0,1,{"$error":"#DIV/0!"},"Total Excluded",{"$f":"COUNTIF(P:P, \"NO\")","v":0}]
[6,null,null,null,{"$f":"IF(D7>$W$3,InvalidPretestScore())","v":false},{"$error":"#DIV/0!"},0,null,{"$f":"IF(H7>$W$4,InvalidPosttestScore())","v":false},{"$error":"#DIV/0!"},{"$error":"#DIV/0!"},{"$error":"#DIV/0!"},0,0,0,"YES",1,1,0,1,{"$error":"#DIV/0!"},"Total Counted",{"$f":"COUNTIF(R2:R181, \"=3\")","v":0}]
[7,null,null,null,{"$f":"IF(D8>$W$3,InvalidPretestScore())","v":false},{"$error":"#DIV/0!"},0,null,{"$f":"IF(H8>$W$4,InvalidPosttestScore())","v":false},{"$error":"#DIV/0!"},{"$error":"#DIV/0!"},{"$error":"#DIV/0!"},0,0,0,"YES",1,1,0,1,{"$error":"#DIV/0!"},"Target Met (Counted)",{"$f":"COUNTIF(T1:T181,\"=4\")","v":0}]
[8,null,null,null,{"$f":"IF(D9>$W$3,InvalidPretestScore())","v":false},{"$error":"#DIV/0!"},0,null,{"$f":"IF(H9>$W$4,InvalidPosttestScore())","v":false},{"$error":"#DIV/0!"},{"$error":"#DIV/0!"},{"$error":"#DIV/0!"},0,0,0,"YES",1,1,0,1,{"$error":"#DIV/0!"},"Target Did Not Meet (Counted)",{"$f":"W7-W8","v":0}]
[9,null,null,null,{"$f":"IF(D10>$W$3,InvalidPretestScore())","v":false},{"$error":"#DIV/0!"},0,null,{"$f":"IF(H10>$W$4,InvalidPosttestScore())","v":false},{"$error":"#DIV/0!"},{"$error":"#DIV/0!"},{"$error":"#DIV/0!"},0,0,0,"YES",1,1,0,1,{"$error":"#DIV/0!"},"Proficiency Persentage",{"$f":"$W$8/$W$7","v":{"$error":"#DIV/0!"}}]
[10,null,null,null,{"$f":"IF(D11>$W$3,InvalidPretestScore())","v":false},{"$error":"#DIV/0!"},0,null,{"$f":"IF(H11>$W$4,InvalidPosttestScore())","v":false},{"$error":"#DIV/0!"},{"$error":"#DIV/0!"},{"$error":"#DIV/0!"},0,0,0,"YES",1,1,0,1,{"$error":"#DIV/0!"}]
[11,null,null,null,{"$f":"IF(D12>$W$3,InvalidPretestScore())","v":false},{"$error":"#DIV/0!"},0,null,{"$f":"IF(H12>$W$4,InvalidPosttestScore())","v":false},{"$error":"#DIV/0!"},{"$error":"#DIV/0!"},{"$error":"#DIV/0!"},0,0,0,"YES",1,1,0,1,{"$error":"#DIV/0!"}]
[12,null,null,null,{"$f":"IF(D13>$W$3,InvalidPretestScore())","v":false},{"$error":"#DIV/0!"},0,null,{"$f":"IF(H13>$W$4,InvalidPosttestScore())","v":false},{"$error":"#DIV/0!"},{"$error":"#DIV/0!"},{"$error":"#DIV/0!"},0,0,0,"YES",1,1,0,1,{"$error":"#DIV/0!"}]
[13,null,null,null,{"$f":"IF(D14>$W$3,InvalidPretestScore())","v":false},{"$error":"#DIV/0!"},0,null,{"$f":"IF(H14>$W$4,InvalidPosttestScore())","v":false},{"$error":"#DIV/0!"},{"$error":"#DIV/0!"},{"$error":"#DIV/0!"},0,0,0,"YES",1,1,0,1,{"$error":"#DIV/0!"}]
[14,null,null,null,{"$f":"IF(D15>$W$3,InvalidPretestScore())","v":false},{"$error":"#DIV/0!"},0,null,{"$f":"IF(H15>$W$4,InvalidPosttestScore())","v":false},{"$error":"#DIV/0!"},{"$error":"#DIV/0!"},{"$error":"#DIV/0!"},0,0,0,"YES",1,1,0,1,{"$error":"#DIV/0!"}]
[15,null,null,null,{"$f":"IF(D16>$W$3,InvalidPretestScore())","v":false},{"$error":"#DIV/0!"},0,null,{"$f":"IF(H16>$W$4,InvalidPosttestScore())","v":false},{"$error":"#DIV/0!"},{"$error":"#DIV/0!"},{"$error":"#DIV/0!"},0,0,0,"YES",1,1,0,1,{"$error":"#DIV/0!"}]
[16,null,null,null,{"$f":"IF(D17>$W$3,InvalidPretestScore())","v":false},{"$error":"#DIV/0!"},0,null,{"$f":"IF(H17>$W$4,InvalidPosttestScore())","v":false},{"$error":"#DIV/0!"},{"$error":"#DIV/0!"},{"$error":"#DIV/0!"},0,0,0,"YES",1,1,0,1,{"$error":"#DIV/0!"}]
[17,null,null,null,{"$f":"IF(D18>$W$3,InvalidPretestScore())","v":false},{"$error":"#DIV/0!"},0,null,{"$f":"IF(H18>$W$4,InvalidPosttestScore())","v":false},{"$error":"#DIV/0!"},{"$error":"#DIV/0!"},{"$error":"#DIV/0!"},0,0,0,"YES",1,1,0,1,{"$error":"#DIV/0!"}]
[18,null,null,null,{"$f":"IF(D19>$W$3,InvalidPretestScore())","v":false},{"$error":"#DIV/0!"},0,null,{"$f":"IF(H19>$W$4,InvalidPosttestScore())","v":false},{"$error":"#DIV/0!"},{"$error":"#DIV/0!"},{"$error":"#DIV/0!"},0,0,0,"YES",1,1,0,1,{"$error":"#DIV/0!"}]
[19,null,null,null,{"$f":"IF(D20>$W$3,InvalidPretestScore())","v":false},{"$error":"#DIV/0!"},0,null,{"$f":"IF(H20>$W$4,InvalidPosttestScore())","v":false},{"$error":"#DIV/0!"},{"$error":"#DIV/0!"},{"$error":"#DIV/0!"},0,0,0,"YES",1,1,0,1,{"$error":"#DIV/0!"}]
[20,null,null,null,{"$f":"IF(D21>$W$3,InvalidPretestScore())","v":false},{"$error":"#DIV/0!"},0,null,{"$f":"IF(H21>$W$4,InvalidPosttestScore())","v":false},{"$error":"#DIV/0!"},{"$error":"#DIV/0!"},{"$error":"#DIV/0!"},0,0,0,"YES",1,1,0,1,{"$error":"#DIV/0!"}]
[21,null,null,null,{"$f":"IF(D22>$W$3,InvalidPretestScore())","v":false},{"$error":"#DIV/0!"},0,null,{"$f":"IF(H22>$W$4,InvalidPosttestScore())","v":false},{"$error":"#DIV/0!"},{"$error":"#DIV/0!"},{"$error":"#DIV/0!"},0,0,0,"YES",1,1,0,1,{"$error":"#DIV/0!"}]
[22,null,null,null,{"$f":"IF(D23>$W$3,InvalidPretestScore())","v":false},{"$error":"#DIV/0!"},0,null,{"$f":"IF(H23>$W$4,InvalidPosttestScore())","v":false},{"$error":"#DIV/0!"},{"$error":"#DIV/0!"},{"$error":"#DIV/0!"},0,0,0,"YES",1,1,0,1,{"$error":"#DIV/0!"}]
[23,null,null,null,{"$f":"IF(D24>$W$3,InvalidPretestScore())","v":false},{"$error":"#DIV/0!"},0,null,{"$f":"IF(H24>$W$4,InvalidPosttestScore())","v":false},{"$error":"#DIV/0!"},{"$error":"#DIV/0!"},{"$error":"#DIV/0!"},0,0,0,"YES",1,1,0,1,{"$error":"#DIV/0!"}]
[24,null,null,null,{"$f":"IF(D25>$W$3,InvalidPretestScore())","v":false},{"$error":"#DIV/0!"},0,null,{"$f":"IF(H25>$W$4,InvalidPosttestScore())","v":false},{"$error":"#DIV/0!"},{"$error":"#DIV/0!"},{"$error":"#DIV/0!"},0,0,0,"YES",1,1,0,1,{"$error":"#DIV/0!"}]
[25,null,null,null,{"$f":"IF(D26>$W$3,InvalidPretestScore())","v":false},{"$error":"#DIV/0!"},0,null,{"$f":"IF(H26>$W$4,InvalidPosttestScore())","v":false},{"$error":"#DIV/0!"},{"$error":"#DIV/0!"},{"$error":"#DIV/0!"},0,0,0,"YES",1,1,0,1,{"$error":"#DIV/0!"}]
[26,null,null,null,{"$f":"IF(D27>$W$3,InvalidPretestScore())","v":false},{"$error":"#DIV/0!"},0,null,{"$f":"IF(H27>$W$4,InvalidPosttestScore())","v":false},{"$error":"#DIV/0!"},{"$error":"#DIV/0!"},{"$error":"#DIV/0!"},0,0,0,"YES",1,1,0,1,{"$error":"#DIV/0!"}]
[27,null,null,null,{"$f":"IF(D28>$W$3,InvalidPretestScore())","v":false},{"$error":"#DIV/0!"},0,null,{"$f":"IF(H28>$W$4,InvalidPosttestScore())","v":false},{"$error":"#DIV/0!"},{"$error":"#DIV/0!"},{"$error":"#DIV/0!"},0,0,0,"YES",1,1,0,1,{"$error":"#DIV/0!"}]
[28,null,null,null,{"$f":"IF(D29>$W$3,InvalidPretestScore())","v":false},{"$error":"#DIV/0!"},0,null,{"$f":"IF(H29>$W$4,InvalidPosttestScore())","v":false},{"$error":"#DIV/0!"},{"$error":"#DIV/0!"},{"$error":"#DIV/0!"},0,0,0,"YES",1,1,0,1,{"$error":"#DIV/0!"}]
[29,null,null,null,{"$f":"IF(D30>$W$3,InvalidPretestScore())","v":false},{"$error":"#DIV/0!"},0,null,{"$f":"IF(H30>$W$4,InvalidPosttestScore())","v":false},{"$error":"#DIV/0!"},{"$error":"#DIV/0!"},{"$error":"#DIV/0!"},0,0,0,"YES",1,1,0,1,{"$error":"#DIV/0!"}]
[30,null,null,null,{"$f":"IF(D31>$W$3,InvalidPretestScore())","v":false},{"$error":"#DIV/0!"},0,null,{"$f":"IF(H31>$W$4,InvalidPosttestScore())","v":false},{"$error":"#DIV/0!"},{"$error":"#DIV/0!"},{"$error":"#DIV/0!"},0,0,0,"YES",1,1,0,1,{"$error":"#DIV/0!"}]
[31,null,null,null,{"$f":"IF(D32>$W$3,InvalidPretestScore())","v":false},{"$error":"#DIV/0!"},0,null,{"$f":"IF(H32>$W$4,InvalidPosttestScore())","v":false},{"$error":"#DIV/0!"},{"$error":"#DIV/0!"},{"$error":"#DIV/0!"},0,0,0,"YES",1,1,0,1,{"$error":"#DIV/0!"}]
[32,null,null,null,{"$f":"IF(D33>$W$3,InvalidPretestScore())","v":false},{"$error":"#DIV/0!"},0,null,{"$f":"IF(H33>$W$4,InvalidPosttestScore())","v":false},{"$error":"#DIV/0!"},{"$error":"#DIV/0!"},{"$error":"#DIV/0!"},0,0,0,"YES",1,1,0,1,{"$error":"#DIV/0!"}]
[33,null,null,null,{"$f":"IF(D34>$W$3,InvalidPretestScore())","v":false},{"$error":"#DIV/0!"},{"$f":"(($W$3-D34)/2)+D34","v":0},null,{"$f":"IF(H34>$W$4,InvalidPosttestScore())","v":false},{"$f":"H34/$W$4","v":{"$error":"#DIV/0!"}},{"$f":"L34*$W$4","v":{"$error":"#DIV/0!"}},{"$f":"G34/$W$3","v":{"$error":"#DIV/0!"}},0,0,0,"YES",1,1,0,1,{"$f":"IF(AND(J34>=L34),\"YES\",IF(AND(J34<L34,J34>=1%),\"NO\",IF(AND(J34=0%),\"INVALID\")))","v":{"$error":"#DIV/0!"}}]
[34,null,null,null,{"$f":"IF(D35>$W$3,InvalidPretestScore())","v":false},{"$error":"#DIV/0!"},0,null,{"$f":"IF(H35>$W$4,InvalidPosttestScore())","v":false},{"$error":"#DIV/0!"},{"$error":"#DIV/0!"},{"$error":"#DIV/0!"},0,0,0,"YES",1,1,0,1,{"$error":"#DIV/0!"}]
[35,null,null,null,{"$f":"IF(D36>$W$3,InvalidPretestScore())","v":false},{"$error":"#DIV/0!"},0,null,{"$f":"IF(H36>$W$4,InvalidPosttestScore())","v":false},{"$error":"#DIV/0!"},{"$error":"#DIV/0!"},{"$error":"#DIV/0!"},0,0,0,"YES",1,1,0,1,{"$error":"#DIV/0!"}]
[36,null,null,null,{"$f":"IF(D37>$W$3,InvalidPretestScore())","v":false},{"$error":"#DIV/0!"},0,null,{"$f":"IF(H37>$W$4,InvalidPosttestScore())","v":false},{"$error":"#DIV/0!"},{"$error":"#DIV/0!"},{"$error":"#DIV/0!"},0,0,0,"YES",1,1,0,1,{"$error":"#DIV/0!"}]
[37,null,null,null,{"$f":"IF(D38>$W$3,InvalidPretestScore())","v":false},{"$error":"#DIV/0!"},0,null,{"$f":"IF(H38>$W$4,InvalidPosttestScore())","v":false},{"$error":"#DIV/0!"},{"$error":"#DIV/0!"},{"$error":"#DIV/0!"},0,0,0,"YES",1,1,0,1,{"$error":"#DIV/0!"}]
[38,null,null,null,{"$f":"IF(D39>$W$3,InvalidPretestScore())","v":false},{"$error":"#DIV/0!"},0,null,{"$f":"IF(H39>$W$4,InvalidPosttestScore())","v":false},{"$error":"#DIV/0!"},{"$error":"#DIV/0!"},{"$error":"#DIV/0!"},0,0,0,"YES",1,1,0,1,{"$error":"#DIV/0!"}]
[39,null,null,null,{"$f":"IF(D40>$W$3,InvalidPretestScore())","v":false},{"$error":"#DIV/0!"},0,null,{"$f":"IF(H40>$W$4,InvalidPosttestScore())","v":false},{"$error":"#DIV/0!"},{"$error":"#DIV/0!"},{"$error":"#DIV/0!"},0,0,0,"YES",1,1,0,1,{"$error":"#DIV/0!"}]
[40,null,null,null,{"$f":"IF(D41>$W$3,InvalidPretestScore())","v":false},{"$error":"#DIV/0!"},0,null,{"$f":"IF(H41>$W$4,InvalidPosttestScore())","v":false},{"$error":"#DIV/0!"},{"$error":"#DIV/0!"},{"$error":"#DIV/0!"},0,0,0,"YES",1,1,0,1,{"$error":"#DIV/0!"}]
[41,null,null,null,{"$f":"IF(D42>$W$3,InvalidPretestScore())","v":false},{"$error":"#DIV/0!"},0,null,{"$f":"IF(H42>$W$4,InvalidPosttestScore())","v":false},{"$error":"#DIV/0!"},{"$error":"#DIV/0!"},{"$error":"#DIV/0!"},0,0,0,"YES",1,1,0,1,{"$error":"#DIV/0!"}]
[42,null,null,null,{"$f":"IF(D43>$W$3,InvalidPretestScore())","v":false},{"$error":"#DIV/0!"},0,null,{"$f":"IF(H43>$W$4,InvalidPosttestScore())","v":false},{"$error":"#DIV/0!"},{"$error":"#DIV/0!"},{"$error":"#DIV/0!"},0,0,0,"YES",1,1,0,1,{"$error":"#DIV/0!"}]
[43,null,null,null,{"$f":"IF(D44>$W$3,InvalidPretestScore())","v":false},{"$error":"#DIV/0!"},0,null,{"$f":"IF(H44>$W$4,InvalidPosttestScore())","v":false},{"$error":"#DIV/0!"},{"$error":"#DIV/0!"},{"$error":"#DIV/0!"},0,0,0,"YES",1,1,0,1,{"$error":"#DIV/0!"}]
[44,null,null,null,{"$f":"IF(D45>$W$3,InvalidPretestScore())","v":false},{"$error":"#DIV/0!"},0,null,{"$f":"IF(H45>$W$4,InvalidPosttestScore())","v":false},{"$error":"#DIV/0!"},{"$error":"#DIV/0!"},{"$error":"#DIV/0!"},0,0,0,"YES",1,1,0,1,{"$error":"#DIV/0!"}]
[45,null,null,null,{"$f":"IF(D46>$W$3,InvalidPretestScore())","v":false},{"$error":"#DIV/0!"},0,null,{"$f":"IF(H46>$W$4,InvalidPosttestScore())","v":false},{"$error":"#DIV/0!"},{"$error":"#DIV/0!"},{"$error":"#DIV/0!"},0,0,0,"YES",1,1,0,1,{"$error":"#DIV/0!"}]
[46,null,null,null,{"$f":"IF(D47>$W$3,InvalidPretestScore())","v":false},{"$error":"#DIV/0!"},0,null,{"$f":"IF(H47>$W$4,InvalidPosttestScore())","v":false},{"$error":"#DIV/0!"},{"$error":"#DIV/0!"},{"$error":"#DIV/0!"},0,0,0,"YES",1,1,0,1,{"$error":"#DIV/0!"}]
[47,null,null,null,{"$f":"IF(D48>$W$3,InvalidPretestScore())","v":false},{"$error":"#DIV/0!"},0,null,{"$f":"IF(H48>$W$4,InvalidPosttestScore())","v":false},{"$error":"#DIV/0!"},{"$error":"#DIV/0!"},{"$error":"#DIV/0!"},0,0,0,"YES",1,1,0,1,{"$error":"#DIV/0!"}]
[48,null,null,null,{"$f":"IF(D49>$W$3,InvalidPretestScore())","v":false},{"$error":"#DIV/0!"},0,null,{"$f":"IF(H49>$W$4,InvalidPosttestScore())","v":false},{"$error":"#DIV/0!"},{"$error":"#DIV/0!"},{"$error":"#DIV/0!"},0,0,0,"YES",1,1,0,1,{"$error":"#DIV/0!"}]
[49,null,null,null,{"$f":"IF(D50>$W$3,InvalidPretestScore())","v":false},{"$error":"#DIV/0!"},0,null,{"$f":"IF(H50>$W$4,InvalidPosttestScore())","v":false},{"$error":"#DIV/0!"},{"$error":"#DIV/0!"},{"$error":"#DIV/0!"},0,0,0,"YES",1,1,0,1,{"$error":"#DIV/0!"}]
[50,null,null,null,{"$f":"IF(D51>$W$3,InvalidPretestScore())","v":false},{"$error":"#DIV/0!"},0,null,{"$f":"IF(H51>$W$4,InvalidPosttestScore())","v":false},{"$error":"#DIV/0!"},{"$error":"#DIV/0!"},{"$error":"#DIV/0!"},0,0,0,"YES",1,1,0,1,{"$error":"#DIV/0!"}]
[51,null,null,null,{"$f":"IF(D52>$W$3,InvalidPretestScore())","v":false},{"$error":"#DIV/0!"},0,null,{"$f":"IF(H52>$W$4,InvalidPosttestScore())","v":false},{"$error":"#DIV/0!"},{"$error":"#DIV/0!"},{"$error":"#DIV/0!"},0,0,0,"YES",1,1,0,1,{"$error":"#DIV/0!"}]
[52,null,null,null,{"$f":"IF(D53>$W$3,InvalidPretestScore())","v":false},{"$error":"#DIV/0!"},0,null,{"$f":"IF(H53>$W$4,InvalidPosttestScore())","v":false},{"$error":"#DIV/0!"},{"$error":"#DIV/0!"},{"$error":"#DIV/0!"},0,0,0,"YES",1,1,0,1,{"$error":"#DIV/0!"}]
[53,null,null,null,{"$f":"IF(D54>$W$3,InvalidPretestScore())","v":false},{"$error":"#DIV/0!"},0,null,{"$f":"IF(H54>$W$4,InvalidPosttestScore())","v":false},{"$error":"#DIV/0!"},{"$error":"#DIV/0!"},{"$error":"#DIV/0!"},0,0,0,"YES",1,1,0,1,{"$error":"#DIV/0!"}]
[54,null,null,null,{"$f":"IF(D55>$W$3,InvalidPretestScore())","v":false},{"$error":"#DIV/0!"},0,null,{"$f":"IF(H55>$W$4,InvalidPosttestScore())","v":false},{"$error":"#DIV/0!"},{"$error":"#DIV/0!"},{"$error":"#DIV/0!"},0,0,0,"YES",1,1,0,1,{"$error":"#DIV/0!"}]
[55,null,null,null,{"$f":"IF(D56>$W$3,InvalidPretestScore())","v":false},{"$error":"#DIV/0!"},0,null,{"$f":"IF(H56>$W$4,InvalidPosttestScore())","v":false},{"$error":"#DIV/0!"},{"$error":"#DIV/0!"},{"$error":"#DIV/0!"},0,0,0,"YES",1,1,0,1,{"$error":"#DIV/0!"}]
[56,null,null,null,{"$f":"IF(D57>$W$3,InvalidPretestScore())","v":false},{"$error":"#DIV/0!"},0,null,{"$f":"IF(H57>$W$4,InvalidPosttestScore())","v":false},{"$error":"#DIV/0!"},{"$error":"#DIV/0!"},{"$error":"#DIV/0!"},0,0,0,"YES",1,1,0,1,{"$error":"#DIV/0!"}]
[57,null,null,null,{"$f":"IF(D58>$W$3,InvalidPretestScore())","v":false},{"$error":"#DIV/0!"},0,null,{"$f":"IF(H58>$W$4,InvalidPosttestScore())","v":false},{"$error":"#DIV/0!"},{"$error":"#DIV/0!"},{"$error":"#DIV/0!"},0,0,0,"YES",1,1,0,1,{"$error":"#DIV/0!"}]
[58,null,null,null,{"$f":"IF(D59>$W$3,InvalidPretestScore())","v":false},{"$error":"#DIV/0!"},0,null,{"$f":"IF(H59>$W$4,InvalidPosttestScore())","v":false},{"$error":"#DIV/0!"},{"$error":"#DIV/0!"},{"$error":"#DIV/0!"},0,0,0,"YES",1,1,0,1,{"$error":"#DIV/0!"}]
[59,null,null,null,{"$f":"IF(D60>$W$3,InvalidPretestScore())","v":false},{"$error":"#DIV/0!"},0,null,{"$f":"IF(H60>$W$4,InvalidPosttestScore())","v":false},{"$error":"#DIV/0!"},{"$error":"#DIV/0!"},{"$error":"#DIV/0!"},0,0,0,"YES",1,1,0,1,{"$error":"#DIV/0!"}]
[60,null,null,null,{"$f":"IF(D61>$W$3,InvalidPretestScore())","v":false},{"$error":"#DIV/0!"},0,null,{"$f":"IF(H61>$W$4,InvalidPosttestScore())","v":false},{"$error":"#DIV/0!"},{"$error":"#DIV/0!"},{"$error":"#DIV/0!"},0,0,0,"YES",1,1,0,1,{"$error":"#DIV/0!"}]
[61,null,null,null,{"$f":"IF(D62>$W$3,InvalidPretestScore())","v":false},{"$error":"#DIV/0!"},0,null,{"$f":"IF(H62>$W$4,InvalidPosttestScore())","v":false},{"$error":"#DIV/0!"},{"$error":"#DIV/0!"},{"$error":"#DIV/0!"},0,0,0,"YES",1,1,0,1,{"$error":"#DIV/0!"}]
[62,null,null,null,{"$f":"IF(D63>$W$3,InvalidPretestScore())","v":false},{"$error":"#DIV/0!"},0,null,{"$f":"IF(H63>$W$4,InvalidPosttestScore())","v":false},{"$error":"#DIV/0!"},{"$error":"#DIV/0!"},{"$error":"#DIV/0!"},0,0,0,"YES",1,1,0,1,{"$error":"#DIV/0!"}]
[63,null,null,null,{"$f":"IF(D64>$W$3,InvalidPretestScore())","v":false},{"$error":"#DIV/0!"},0,null,{"$f":"IF(H64>$W$4,InvalidPosttestScore())","v":false},{"$error":"#DIV/0!"},{"$error":"#DIV/0!"},{"$error":"#DIV/0!"},0,0,0,"YES",1,1,0,1,{"$error":"#DIV/0!"}]
[64,null,null,null,{"$f":"IF(D65>$W$3,InvalidPretestScore())","v":false},{"$error":"#DIV/0!"},0,null,{"$f":"IF(H65>$W$4,InvalidPosttestScore())","v":false},{"$error":"#DIV/0!"},{"$error":"#DIV/0!"},{"$error":"#DIV/0!"},0,0,0,"YES",1,1,0,1,{"$error":"#DIV/0!"}]
[65,null,null,null,{"$f":"IF(D66>$W$3,InvalidPretestScore())","v":false},{"$error":"#DIV/0!"},{"$f":"(($W$3-D66)/2)+D66","v":0},null,{"$f":"IF(H66>$W$4,InvalidPosttestScore())","v":false},{"$f":"H66/$W$4","v":{"$error":"#DIV/0!"}},{"$f":"L66*$W$4","v":{"$error":"#DIV/0!"}},{"$f":"G66/$W$3","v":{"$error":"#DIV/0!"}},0,0,0,"YES",1,1,0,1,{"$f":"IF(AND(J66>=L66),\"YES\",IF(AND(J66<L66,J66>=1%),\"NO\",IF(AND(J66=0%),\"INVALID\")))","v":{"$error":"#DIV/0!"}}]
[66,null,null,null,{"$f":"IF(D67>$W$3,InvalidPretestScore())","v":false},{"$f":"(D67/$W$3)","v":{"$error":"#DIV/0!"}},0,null,{"$f":"IF(H67>$W$4,InvalidPosttestScore())","v":false},{"$f":"H67/$W$4","v":{"$error":"#DIV/0!"}},{"$error":"#DIV/0!"},{"$error":"#DIV/0!"},{"$f":"IF(D67 = 0, 0,1)","v":0},{"$f":"IF(H67 = 0, 0,1)","v":0},{"$f":"SUM(M67,N67)","v":0},"YES",{"$f":"COUNTIF(P67,\"=YES\")","v":1},{"$f":"SUM(M67:N67,Q67)","v":1},{"$f":"COUNTIF(U67,\"=yes\")","v":0},{"$f":"SUM(R67,S67)","v":1},{"$error":"#DIV/0!"}]
[67,null,null,null,{"$f":"IF(D68>$W$3,InvalidPretestScore())","v":false},{"$error":"#DIV/0!"},0,null,{"$f":"IF(H68>$W$4,InvalidPosttestScore())","v":false},{"$error":"#DIV/0!"},{"$error":"#DIV/0!"},{"$error":"#DIV/0!"},0,0,0,"YES",1,1,0,1,{"$error":"#DIV/0!"}]
[68,null,null,null,{"$f":"IF(D69>$W$3,InvalidPretestScore())","v":false},{"$error":"#DIV/0!"},0,null,{"$f":"IF(H69>$W$4,InvalidPosttestScore())","v":false},{"$error":"#DIV/0!"},{"$error":"#DIV/0!"},{"$error":"#DIV/0!"},0,0,0,"YES",1,1,0,1,{"$error":"#DIV/0!"}]
[69,null,null,null,{"$f":"IF(D70>$W$3,InvalidPretestScore())","v":false},{"$error":"#DIV/0!"},0,null,{"$f":"IF(H70>$W$4,InvalidPosttestScore())","v":false},{"$error":"#DIV/0!"},{"$error":"#DIV/0!"},{"$error":"#DIV/0!"},0,0,0,"YES",1,1,0,1,{"$error":"#DIV/0!"}]
[70,null,null,null,{"$f":"IF(D71>$W$3,InvalidPretestScore())","v":false},{"$error":"#DIV/0!"},0,null,{"$f":"IF(H71>$W$4,InvalidPosttestScore())","v":false},{"$error":"#DIV/0!"},{"$error":"#DIV/0!"},{"$error":"#DIV/0!"},0,0,0,"YES",1,1,0,1,{"$error":"#DIV/0!"}]
[71,null,null,null,{"$f":"IF(D72>$W$3,InvalidPretestScore())","v":false},{"$error":"#DIV/0!"},0,null,{"$f":"IF(H72>$W$4,InvalidPosttestScore())","v":false},{"$error":"#DIV/0!"},{"$error":"#DIV/0!"},{"$error":"#DIV/0!"},0,0,0,"YES",1,1,0,1,{"$error":"#DIV/0!"}]
[72,null,null,null,{"$f":"IF(D73>$W$3,InvalidPretestScore())","v":false},{"$error":"#DIV/0!"},0,null,{"$f":"IF(H73>$W$4,InvalidPosttestScore())","v":false},{"$error":"#DIV/0!"},{"$error":"#DIV/0!"},{"$error":"#DIV/0!"},0,0,0,"YES",1,1,0,1,{"$error":"#DIV/0!"}]
[73,null,null,null,{"$f":"IF(D74>$W$3,InvalidPretestScore())","v":false},{"$error":"#DIV/0!"},0,null,{"$f":"IF(H74>$W$4,InvalidPosttestScore())","v":false},{"$error":"#DIV/0!"},{"$error":"#DIV/0!"},{"$error":"#DIV/0!"},0,0,0,"YES",1,1,0,1,{"$error":"#DIV/0!"}]
[74,null,null,null,{"$f":"IF(D75>$W$3,InvalidPretestScore())","v":false},{"$error":"#DIV/0!"},0,null,{"$f":"IF(H75>$W$4,InvalidPosttestScore())","v":false},{"$error":"#DIV/0!"},{"$error":"#DIV/0!"},{"$error":"#DIV/0!"},0,0,0,"YES",1,1,0,1,{"$error":"#DIV/0!"}]
[75,null,null,null,{"$f":"IF(D76>$W$3,InvalidPretestScore())","v":false},{"$error":"#DIV/0!"},0,null,{"$f":"IF(H76>$W$4,InvalidPosttestScore())","v":false},{"$error":"#DIV/0!"},{"$error":"#DIV/0!"},{"$error":"#DIV/0!"},0,0,0,"YES",1,1,0,1,{"$error":"#DIV/0!"}]
[76,null,null,null,{"$f":"IF(D77>$W$3,InvalidPretestScore())","v":false},{"$error":"#DIV/0!"},0,null,{"$f":"IF(H77>$W$4,InvalidPosttestScore())","v":false},{"$error":"#DIV/0!"},{"$error":"#DIV/0!"},{"$error":"#DIV/0!"},0,0,0,"YES",1,1,0,1,{"$error":"#DIV/0!"}]
[77,null,null,null,{"$f":"IF(D78>$W$3,InvalidPretestScore())","v":false},{"$error":"#DIV/0!"},0,null,{"$f":"IF(H78>$W$4,InvalidPosttestScore())","v":false},{"$error":"#DIV/0!"},{"$error":"#DIV/0!"},{"$error":"#DIV/0!"},0,0,0,"YES",1,1,0,1,{"$error":"#DIV/0!"}]
[78,null,null,null,{"$f":"IF(D79>$W$3,InvalidPretestScore())","v":false},{"$error":"#DIV/0!"},0,null,{"$f":"IF(H79>$W$4,InvalidPosttestScore())","v":false},{"$error":"#DIV/0!"},{"$error":"#DIV/0!"},{"$error":"#DIV/0!"},0,0,0,"YES",1,1,0,1,{"$error":"#DIV/0!"}]
[79,null,null,null,{"$f":"IF(D80>$W$3,InvalidPretestScore())","v":false},{"$error":"#DIV/0!"},0,null,{"$f":"IF(H80>$W$4,InvalidPosttestScore())","v":false},{"$error":"#DIV/0!"},{"$error":"#DIV/0!"},{"$error":"#DIV/0!"},0,0,0,"YES",1,1,0,1,{"$error":"#DIV/0!"}]
[80,null,null,null,{"$f":"IF(D81>$W$3,InvalidPretestScore())","v":false},{"$error":"#DIV/0!"},0,null,{"$f":"IF(H81>$W$4,InvalidPosttestScore())","v":false},{"$error":"#DIV/0!"},{"$error":"#DIV/0!"},{"$error":"#DIV/0!"},0,0,0,"YES",1,1,0,1,{"$error":"#DIV/0!"}]
[81,null,null,null,{"$f":"IF(D82>$W$3,InvalidPretestScore())","v":false},{"$error":"#DIV/0!"},0,null,{"$f":"IF(H82>$W$4,InvalidPosttestScore())","v":false},{"$error":"#DIV/0!"},{"$error":"#DIV/0!"},{"$error":"#DIV/0!"},0,0,0,"YES",1,1,0,1,{"$error":"#DIV/0!"}]
[82,null,null,null,{"$f":"IF(D83>$W$3,InvalidPretestScore())","v":false},{"$error":"#DIV/0!"},0,null,{"$f":"IF(H83>$W$4,InvalidPosttestScore())","v":false},{"$error":"#DIV/0!"},{"$error":"#DIV/0!"},{"$error":"#DIV/0!"},0,0,0,"YES",1,1,0,1,{"$error":"#DIV/0!"}]
[83,null,null,null,{"$f":"IF(D84>$W$3,InvalidPretestScore())","v":false},{"$error":"#DIV/0!"},0,null,{"$f":"IF(H84>$W$4,InvalidPosttestScore())","v":false},{"$error":"#DIV/0!"},{"$error":"#DIV/0!"},{"$error":"#DIV/0!"},0,0,0,"YES",1,1,0,1,{"$error":"#DIV/0!"}]
[84,null,null,null,{"$f":"IF(D85>$W$3,InvalidPretestScore())","v":false},{"$error":"#DIV/0!"},0,null,{"$f":"IF(H85>$W$4,InvalidPosttestScore())","v":false},{"$error":"#DIV/0!"},{"$error":"#DIV/0!"},{"$error":"#DIV/0!"},0,0,0,"YES",1,1,0,1,{"$error":"#DIV/0!"}]
[85,null,null,null,{"$f":"IF(D86>$W$3,InvalidPretestScore())","v":false},{"$error":"#DIV/0!"},0,null,{"$f":"IF(H86>$W$4,InvalidPosttestScore())","v":false},{"$error":"#DIV/0!"},{"$error":"#DIV/0!"},{"$error":"#DIV/0!"},0,0,0,"YES",1,1,0,1,{"$error":"#DIV/0!"}]
[86,null,null,null,{"$f":"IF(D87>$W$3,InvalidPretestScore())","v":false},{"$error":"#DIV/0!"},0,null,{"$f":"IF(H87>$W$4,InvalidPosttestScore())","v":false},{"$error":"#DIV/0!"},{"$error":"#DIV/0!"},{"$error":"#DIV/0!"},0,0,0,"YES",1,1,0,1,{"$error":"#DIV/0!"}]
[87,null,null,null,{"$f":"IF(D88>$W$3,InvalidPretestScore())","v":false},{"$error":"#DIV/0!"},0,null,{"$f":"IF(H88>$W$4,InvalidPosttestScore())","v":false},{"$error":"#DIV/0!"},{"$error":"#DIV/0!"},{"$error":"#DIV/0!"},0,0,0,"YES",1,1,0,1,{"$error":"#DIV/0!"}]
[88,null,null,null,{"$f":"IF(D89>$W$3,InvalidPretestScore())","v":false},{"$error":"#DIV/0!"},0,null,{"$f":"IF(H89>$W$4,InvalidPosttestScore())","v":false},{"$error":"#DIV/0!"},{"$error":"#DIV/0!"},{"$error":"#DIV/0!"},0,0,0,"YES",1,1,0,1,{"$error":"#DIV/0!"}]
[89,null,null,null,{"$f":"IF(D90>$W$3,InvalidPretestScore())","v":false},{"$error":"#DIV/0!"},0,null,{"$f":"IF(H90>$W$4,InvalidPosttestScore())","v":false},{"$error":"#DIV/0!"},{"$error":"#DIV/0!"},{"$error":"#DIV/0!"},0,0,0,"YES",1,1,0,1,{"$error":"#DIV/0!"}]
[90,null,null,null,{"$f":"IF(D91>$W$3,InvalidPretestScore())","v":false},{"$error":"#DIV/0!"},0,null,{"$f":"IF(H91>$W$4,InvalidPosttestScore())","v":false},{"$error":"#DIV/0!"},{"$error":"#DIV/0!"},{"$error":"#DIV/0!"},0,0,0,"YES",1,1,0,1,{"$error":"#DIV/0!"}]
[91,null,null,null,{"$f":"IF(D92>$W$3,InvalidPretestScore())","v":false},{"$error":"#DIV/0!"},0,null,{"$f":"IF(H92>$W$4,InvalidPosttestScore())","v":false},{"$error":"#DIV/0!"},{"$error":"#DIV/0!"},{"$error":"#DIV/0!"},0,0,0,"YES",1,1,0,1,{"$error":"#DIV/0!"}]
[92,null,null,null,{"$f":"IF(D93>$W$3,InvalidPretestScore())","v":false},{"$error":"#DIV/0!"},0,null,{"$f":"IF(H93>$W$4,InvalidPosttestScore())","v":false},{"$error":"#DIV/0!"},{"$error":"#DIV/0!"},{"$error":"#DIV/0!"},0,0,0,"YES",1,1,0,1,{"$error":"#DIV/0!"}]
[93,null,null,null,{"$f":"IF(D94>$W$3,InvalidPretestScore())","v":false},{"$error":"#DIV/0!"},0,null,{"$f":"IF(H94>$W$4,InvalidPosttestScore())","v":false},{"$error":"#DIV/0!"},{"$error":"#DIV/0!"},{"$error":"#DIV/0!"},0,0,0,"YES",1,1,0,1,{"$error":"#DIV/0!"}]
[94,null,null,null,{"$f":"IF(D95>$W$3,InvalidPretestScore())","v":false},{"$error":"#DIV/0!"},0,null,{"$f":"IF(H95>$W$4,InvalidPosttestScore())","v":false},{"$error":"#DIV/0!"},{"$error":"#DIV/0!"},{"$error":"#DIV/0!"},0,0,0,"YES",1,1,0,1,{"$error":"#DIV/0!"}]
[95,null,null,null,{"$f":"IF(D96>$W$3,InvalidPretestScore())","v":false},{"$error":"#DIV/0!"},0,null,{"$f":"IF(H96>$W$4,InvalidPosttestScore())","v":false},{"$error":"#DIV/0!"},{"$error":"#DIV/0!"},{"$error":"#DIV/0!"},0,0,0,"YES",1,1,0,1,{"$error":"#DIV/0!"}]
[96,null,null,null,{"$f":"IF(D97>$W$3,InvalidPretestScore())","v":false},{"$error":"#DIV/0!"},0,null,{"$f":"IF(H97>$W$4,InvalidPosttestScore())","v":false},{"$error":"#DIV/0!"},{"$error":"#DIV/0!"},{"$error":"#DIV/0!"},0,0,0,"YES",1,1,0,1,{"$error":"#DIV/0!"}]
[97,null,null,null,{"$f":"IF(D98>$W$3,InvalidPretestScore())","v":false},{"$error":"#DIV/0!"},{"$f":"(($W$3-D98)/2)+D98","v":0},null,{"$f":"IF(H98>$W$4,InvalidPosttestScore())","v":false},{"$error":"#DIV/0!"},{"$f":"L98*$W$4","v":{"$error":"#DIV/0!"}},{"$f":"G98/$W$3","v":{"$error":"#DIV/0!"}},0,0,0,"YES",1,1,0,1,{"$f":"IF(AND(J98>=L98),\"YES\",IF(AND(J98<L98,J98>=1%),\"NO\",IF(AND(J98=0%),\"INVALID\")))","v":{"$error":"#DIV/0!"}}]
[98,null,null,null,{"$f":"IF(D99>$W$3,InvalidPretestScore())","v":false},{"$error":"#DIV/0!"},0,null,{"$f":"IF(H99>$W$4,InvalidPosttestScore())","v":false},{"$error":"#DIV/0!"},{"$error":"#DIV/0!"},{"$error":"#DIV/0!"},0,0,0,"YES",1,1,0,1,{"$error":"#DIV/0!"}]
[99,null,null,null,{"$f":"IF(D100>$W$3,InvalidPretestScore())","v":false},{"$error":"#DIV/0!"},0,null,{"$f":"IF(H100>$W$4,InvalidPosttestScore())","v":false},{"$error":"#DIV/0!"},{"$error":"#DIV/0!"},{"$error":"#DIV/0!"},0,0,0,"YES",1,1,0,1,{"$error":"#DIV/0!"}]
[100,null,null,null,{"$f":"IF(D101>$W$3,InvalidPretestScore())","v":false},{"$error":"#DIV/0!"},0,null,{"$f":"IF(H101>$W$4,InvalidPosttestScore())","v":false},{"$error":"#DIV/0!"},{"$error":"#DIV/0!"},{"$error":"#DIV/0!"},0,0,0,"YES",1,1,0,1,{"$error":"#DIV/0!"}]
[101,null,null,null,{"$f":"IF(D102>$W$3,InvalidPretestScore())","v":false},{"$error":"#DIV/0!"},0,null,{"$f":"IF(H102>$W$4,InvalidPosttestScore())","v":false},{"$error":"#DIV/0!"},{"$error":"#DIV/0!"},{"$error":"#DIV/0!"},0,0,0,"YES",1,1,0,1,{"$error":"#DIV/0!"}]
[102,null,null,null,{"$f":"IF(D103>$W$3,InvalidPretestScore())","v":false},{"$error":"#DIV/0!"},0,null,{"$f":"IF(H103>$W$4,InvalidPosttestScore())","v":false},{"$error":"#DIV/0!"},{"$error":"#DIV/0!"},{"$error":"#DIV/0!"},0,0,0,"YES",1,1,0,1,{"$error":"#DIV/0!"}]
[103,null,null,null,{"$f":"IF(D104>$W$3,InvalidPretestScore())","v":false},{"$error":"#DIV/0!"},0,null,{"$f":"IF(H104>$W$4,InvalidPosttestScore())","v":false},{"$error":"#DIV/0!"},{"$error":"#DIV/0!"},{"$error":"#DIV/0!"},0,0,0,"YES",1,1,0,1,{"$error":"#DIV/0!"}]
[104,null,null,null,{"$f":"IF(D105>$W$3,InvalidPretestScore())","v":false},{"$error":"#DIV/0!"},0,null,{"$f":"IF(H105>$W$4,InvalidPosttestScore())","v":false},{"$error":"#DIV/0!"},{"$error":"#DIV/0!"},{"$error":"#DIV/0!"},0,0,0,"YES",1,1,0,1,{"$error":"#DIV/0!"}]
[105,null,null,null,{"$f":"IF(D106>$W$3,InvalidPretestScore())","v":false},{"$error":"#DIV/0!"},0,null,{"$f":"IF(H106>$W$4,InvalidPosttestScore())","v":false},{"$error":"#DIV/0!"},{"$error":"#DIV/0!"},{"$error":"#DIV/0!"},0,0,0,"YES",1,1,0,1,{"$error":"#DIV/0!"}]
[106,null,null,null,{"$f":"IF(D107>$W$3,InvalidPretestScore())","v":false},{"$error":"#DIV/0!"},0,null,{"$f":"IF(H107>$W$4,InvalidPosttestScore())","v":false},{"$error":"#DIV/0!"},{"$error":"#DIV/0!"},{"$error":"#DIV/0!"},0,0,0,"YES",1,1,0,1,{"$error":"#DIV/0!"}]
[107,null,null,null,{"$f":"IF(D108>$W$3,InvalidPretestScore())","v":false},{"$error":"#DIV/0!"},0,null,{"$f":"IF(H108>$W$4,InvalidPosttestScore())","v":false},{"$error":"#DIV/0!"},{"$error":"#DIV/0!"},{"$error":"#DIV/0!"},0,0,0,"YES",1,1,0,1,{"$error":"#DIV/0!"}]
[108,null,null,null,{"$f":"IF(D109>$W$3,InvalidPretestScore())","v":false},{"$error":"#DIV/0!"},0,null,{"$f":"IF(H109>$W$4,InvalidPosttestScore())","v":false},{"$error":"#DIV/0!"},{"$error":"#DIV/0!"},{"$error":"#DIV/0!"},0,0,0,"YES",1,1,0,1,{"$error":"#DIV/0!"}]
[109,null,null,null,{"$f":"IF(D110>$W$3,InvalidPretestScore())","v":false},{"$error":"#DIV/0!"},0,null,{"$f":"IF(H110>$W$4,InvalidPosttestScore())","v":false},{"$error":"#DIV/0!"},{"$error":"#DIV/0!"},{"$error":"#DIV/0!"},0,0,0,"YES",1,1,0,1,{"$error":"#DIV/0!"}]
[110,null,null,null,{"$f":"IF(D111>$W$3,InvalidPretestScore())","v":false},{"$error":"#DIV/0!"},0,null,{"$f":"IF(H111>$W$4,InvalidPosttestScore())","v":false},{"$error":"#DIV/0!"},{"$error":"#DIV/0!"},{"$error":"#DIV/0!"},0,0,0,"YES",1,1,0,1,{"$error":"#DIV/0!"}]
[111,null,null,null,{"$f":"IF(D112>$W$3,InvalidPretestScore())","v":false},{"$error":"#DIV/0!"},0,null,{"$f":"IF(H112>$W$4,InvalidPosttestScore())","v":false},{"$error":"#DIV/0!"},{"$error":"#DIV/0!"},{"$error":"#DIV/0!"},0,0,0,"YES",1,1,0,1,{"$error":"#DIV/0!"}]
[112,null,null,null,{"$f":"IF(D113>$W$3,InvalidPretestScore())","v":false},{"$error":"#DIV/0!"},0,null,{"$f":"IF(H113>$W$4,InvalidPosttestScore())","v":false},{"$error":"#DIV/0!"},{"$error":"#DIV/0!"},{"$error":"#DIV/0!"},0,0,0,"YES",1,1,0,1,{"$error":"#DIV/0!"}]
[113,null,null,null,{"$f":"IF(D114>$W$3,InvalidPretestScore())","v":false},{"$error":"#DIV/0!"},0,null,{"$f":"IF(H114>$W$4,InvalidPosttestScore())","v":false},{"$error":"#DIV/0!"},{"$error":"#DIV/0!"},{"$error":"#DIV/0!"},0,0,0,"YES",1,1,0,1,{"$error":"#DIV/0!"}]
[114,null,null,null,{"$f":"IF(D115>$W$3,InvalidPretestScore())","v":false},{"$error":"#DIV/0!"},0,null,{"$f":"IF(H115>$W$4,InvalidPosttestScore())","v":false},{"$error":"#DIV/0!"},{"$error":"#DIV/0!"},{"$error":"#DIV/0!"},0,0,0,"YES",1,1,0,1,{"$error":"#DIV/0!"}]
[115,null,null,null,{"$f":"IF(D116>$W$3,InvalidPretestScore())","v":false},{"$error":"#DIV/0!"},0,null,{"$f":"IF(H116>$W$4,InvalidPosttestScore())","v":false},{"$error":"#DIV/0!"},{"$error":"#DIV/0!"},{"$error":"#DIV/0!"},0,0,0,"YES",1,1,0,1,{"$error":"#DIV/0!"}]
[116,null,null,null,{"$f":"IF(D117>$W$3,InvalidPretestScore())","v":false},{"$error":"#DIV/0!"},0,null,{"$f":"IF(H117>$W$4,InvalidPosttestScore())","v":false},{"$error":"#DIV/0!"},{"$error":"#DIV/0!"},{"$error":"#DIV/0!"},0,0,0,"YES",1,1,0,1,{"$error":"#DIV/0!"}]
[117,null,null,null,{"$f":"IF(D118>$W$3,InvalidPretestScore())","v":false},{"$error":"#DIV/0!"},0,null,{"$f":"IF(H118>$W$4,InvalidPosttestScore())","v":false},{"$error":"#DIV/0!"},{"$error":"#DIV/0!"},{"$error":"#DIV/0!"},0,0,0,"YES",1,1,0,1,{"$error":"#DIV/0!"}]
[118,null,null,null,{"$f":"IF(D119>$W$3,InvalidPretestScore())","v":false},{"$error":"#DIV/0!"},0,null,{"$f":"IF(H119>$W$4,InvalidPosttestScore())","v":false},{"$error":"#DIV/0!"},{"$error":"#DIV/0!"},{"$error":"#DIV/0!"},0,0,0,"YES",1,1,0,1,{"$error":"#DIV/0!"}]
[119,null,null,null,{"$f":"IF(D120>$W$3,InvalidPretestScore())","v":false},{"$error":"#DIV/0!"},0,null,{"$f":"IF(H120>$W$4,InvalidPosttestScore())","v":false},{"$error":"#DIV/0!"},{"$error":"#DIV/0!"},{"$error":"#DIV/0!"},0,0,0,"YES",1,1,0,1,{"$error":"#DIV/0!"}]
[120,null,null,null,{"$f":"IF(D121>$W$3,InvalidPretestScore())","v":false},{"$error":"#DIV/0!"},0,null,{"$f":"IF(H121>$W$4,InvalidPosttestScore())","v":false},{"$error":"#DIV/0!"},{"$error":"#DIV/0!"},{"$error":"#DIV/0!"},0,0,0,"YES",1,1,0,1,{"$error":"#DIV/0!"}]
[121,null,null,null,{"$f":"IF(D122>$W$3,InvalidPretestScore())","v":false},{"$error":"#DIV/0!"},0,null,{"$f":"IF(H122>$W$4,InvalidPosttestScore())","v":false},{"$error":"#DIV/0!"},{"$error":"#DIV/0!"},{"$error":"#DIV/0!"},0,0,0,"YES",1,1,0,1,{"$error":"#DIV/0!"}]
[122,null,null,null,{"$f":"IF(D123>$W$3,InvalidPretestScore())","v":false},{"$error":"#DIV/0!"},0,null,{"$f":"IF(H123>$W$4,InvalidPosttestScore())","v":false},{"$error":"#DIV/0!"},{"$error":"#DIV/0!"},{"$error":"#DIV/0!"},0,0,0,"YES",1,1,0,1,{"$error":"#DIV/0!"}]
[123,null,null,null,{"$f":"IF(D124>$W$3,InvalidPretestScore())","v":false},{"$error":"#DIV/0!"},0,null,{"$f":"IF(H124>$W$4,InvalidPosttestScore())","v":false},{"$error":"#DIV/0!"},{"$error":"#DIV/0!"},{"$error":"#DIV/0!"},0,0,0,"YES",1,1,0,1,{"$error":"#DIV/0!"}]
[124,null,null,null,{"$f":"IF(D125>$W$3,InvalidPretestScore())","v":false},{"$error":"#DIV/0!"},0,null,{"$f":"IF(H125>$W$4,InvalidPosttestScore())","v":false},{"$error":"#DIV/0!"},{"$error":"#DIV/0!"},{"$error":"#DIV/0!"},0,0,0,"YES",1,1,0,1,{"$error":"#DIV/0!"}]
[125,null,null,null,{"$f":"IF(D126>$W$3,InvalidPretestScore())","v":false},{"$error":"#DIV/0!"},0,null,{"$f":"IF(H126>$W$4,InvalidPosttestScore())","v":false},{"$error":"#DIV/0!"},{"$error":"#DIV/0!"},{"$error":"#DIV/0!"},0,0,0,"YES",1,1,0,1,{"$error":"#DIV/0!"}]
[126,null,null,null,{"$f":"IF(D127>$W$3,InvalidPretestScore())","v":false},{"$error":"#DIV/0!"},0,null,{"$f":"IF(H127>$W$4,InvalidPosttestScore())","v":false},{"$error":"#DIV/0!"},{"$error":"#DIV/0!"},{"$error":"#DIV/0!"},0,0,0,"YES",1,1,0,1,{"$error":"#DIV/0!"}]
[127,null,null,null,{"$f":"IF(D128>$W$3,InvalidPretestScore())","v":false},{"$error":"#DIV/0!"},0,null,{"$f":"IF(H128>$W$4,InvalidPosttestScore())","v":false},{"$error":"#DIV/0!"},{"$error":"#DIV/0!"},{"$error":"#DIV/0!"},0,0,0,"YES",1,1,0,1,{"$error":"#DIV/0!"}]
[128,null,null,null,{"$f":"IF(D129>$W$3,InvalidPretestScore())","v":false},{"$error":"#DIV/0!"},0,null,{"$f":"IF(H129>$W$4,InvalidPosttestScore())","v":false},{"$error":"#DIV/0!"},{"$error":"#DIV/0!"},{"$error":"#DIV/0!"},0,0,0,"YES",1,1,0,1,{"$error":"#DIV/0!"}]
[129,null,null,null,{"$f":"IF(D130>$W$3,InvalidPretestScore())","v":false},{"$error":"#DIV/0!"},{"$f":"(($W$3-D130)/2)+D130","v":0},null,{"$f":"IF(H130>$W$4,InvalidPosttestScore())","v":false},{"$error":"#DIV/0!"},{"$f":"L130*$W$4","v":{"$error":"#DIV/0!"}},{"$f":"G130/$W$3","v":{"$error":"#DIV/0!"}},0,0,0,"YES",1,1,0,1,{"$f":"IF(AND(J130>=L130),\"YES\",IF(AND(J130<L130,J130>=1%),\"NO\",IF(AND(J130=0%),\"INVALID\")))","v":{"$error":"#DIV/0!"}}]
[130,null,null,null,{"$f":"IF(D131>$W$3,InvalidPretestScore())","v":false},{"$f":"(D131/$W$3)","v":{"$error":"#DIV/0!"}},0,null,{"$f":"IF(H131>$W$4,InvalidPosttestScore())","v":false},{"$f":"H131/$W$4","v":{"$error":"#DIV/0!"}},{"$error":"#DIV/0!"},{"$error":"#DIV/0!"},{"$f":"IF(D131 = 0, 0,1)","v":0},{"$f":"IF(H131 = 0, 0,1)","v":0},{"$f":"SUM(M131,N131)","v":0},"YES",{"$f":"COUNTIF(P131,\"=YES\")","v":1},{"$f":"SUM(M131:N131,Q131)","v":1},{"$f":"COUNTIF(U131,\"=yes\")","v":0},{"$f":"SUM(R131,S131)","v":1},{"$error":"#DIV/0!"}]
[131,null,null,null,{"$f":"IF(D132>$W$3,InvalidPretestScore())","v":false},{"$error":"#DIV/0!"},0,null,{"$f":"IF(H132>$W$4,InvalidPosttestScore())","v":false},{"$error":"#DIV/0!"},{"$error":"#DIV/0!"},{"$error":"#DIV/0!"},0,0,0,"YES",1,1,0,1,{"$error":"#DIV/0!"}]
[132,null,null,null,{"$f":"IF(D133>$W$3,InvalidPretestScore())","v":false},{"$error":"#DIV/0!"},0,null,{"$f":"IF(H133>$W$4,InvalidPosttestScore())","v":false},{"$error":"#DIV/0!"},{"$error":"#DIV/0!"},{"$error":"#DIV/0!"},0,0,0,"YES",1,1,0,1,{"$error":"#DIV/0!"}]
[133,null,null,null,{"$f":"IF(D134>$W$3,InvalidPretestScore())","v":false},{"$error":"#DIV/0!"},0,null,{"$f":"IF(H134>$W$4,InvalidPosttestScore())","v":false},{"$error":"#DIV/0!"},{"$error":"#DIV/0!"},{"$error":"#DIV/0!"},0,0,0,"YES",1,1,0,1,{"$error":"#DIV/0!"}]
[134,null,null,null,{"$f":"IF(D135>$W$3,InvalidPretestScore())","v":false},{"$error":"#DIV/0!"},0,null,{"$f":"IF(H135>$W$4,InvalidPosttestScore())","v":false},{"$error":"#DIV/0!"},{"$error":"#DIV/0!"},{"$error":"#DIV/0!"},0,0,0,"YES",1,1,0,1,{"$error":"#DIV/0!"}]
[135,null,null,null,{"$f":"IF(D136>$W$3,InvalidPretestScore())","v":false},{"$error":"#DIV/0!"},0,null,{"$f":"IF(H136>$W$4,InvalidPosttestScore())","v":false},{"$error":"#DIV/0!"},{"$error":"#DIV/0!"},{"$error":"#DIV/0!"},0,0,0,"YES",1,1,0,1,{"$error":"#DIV/0!"}]
[136,null,null,null,{"$f":"IF(D137>$W$3,InvalidPretestScore())","v":false},{"$error":"#DIV/0!"},0,null,{"$f":"IF(H137>$W$4,InvalidPosttestScore())","v":false},{"$error":"#DIV/0!"},{"$error":"#DIV/0!"},{"$error":"#DIV/0!"},0,0,0,"YES",1,1,0,1,{"$error":"#DIV/0!"}]
[137,null,null,null,{"$f":"IF(D138>$W$3,InvalidPretestScore())","v":false},{"$error":"#DIV/0!"},0,null,{"$f":"IF(H138>$W$4,InvalidPosttestScore())","v":false},{"$error":"#DIV/0!"},{"$error":"#DIV/0!"},{"$error":"#DIV/0!"},0,0,0,"YES",1,1,0,1,{"$error":"#DIV/0!"}]
[138,null,null,null,{"$f":"IF(D139>$W$3,InvalidPretestScore())","v":false},{"$error":"#DIV/0!"},0,null,{"$f":"IF(H139>$W$4,InvalidPosttestScore())","v":false},{"$error":"#DIV/0!"},{"$error":"#DIV/0!"},{"$error":"#DIV/0!"},0,0,0,"YES",1,1,0,1,{"$error":"#DIV/0!"}]
[139,null,null,null,{"$f":"IF(D140>$W$3,InvalidPretestScore())","v":false},{"$error":"#DIV/0!"},0,null,{"$f":"IF(H140>$W$4,InvalidPosttestScore())","v":false},{"$error":"#DIV/0!"},{"$error":"#DIV/0!"},{"$error":"#DIV/0!"},0,0,0,"YES",1,1,0,1,{"$error":"#DIV/0!"}]
[140,null,null,null,{"$f":"IF(D141>$W$3,InvalidPretestScore())","v":false},{"$error":"#DIV/0!"},0,null,{"$f":"IF(H141>$W$4,InvalidPosttestScore())","v":false},{"$error":"#DIV/0!"},{"$error":"#DIV/0!"},{"$error":"#DIV/0!"},0,0,0,"YES",1,1,0,1,{"$error":"#DIV/0!"}]
[141,null,null,null,{"$f":"IF(D142>$W$3,InvalidPretestScore())","v":false},{"$error":"#DIV/0!"},0,null,{"$f":"IF(H142>$W$4,InvalidPosttestScore())","v":false},{"$error":"#DIV/0!"},{"$error":"#DIV/0!"},{"$error":"#DIV/0!"},0,0,0,"YES",1,1,0,1,{"$error":"#DIV/0!"}]
[142,null,null,null,{"$f":"IF(D143>$W$3,InvalidPretestScore())","v":false},{"$error":"#DIV/0!"},0,null,{"$f":"IF(H143>$W$4,InvalidPosttestScore())","v":false},{"$error":"#DIV/0!"},{"$error":"#DIV/0!"},{"$error":"#DIV/0!"},0,0,0,"YES",1,1,0,1,{"$error":"#DIV/0!"}]
[143,null,null,null,{"$f":"IF(D144>$W$3,InvalidPretestScore())","v":false},{"$error":"#DIV/0!"},0,null,{"$f":"IF(H144>$W$4,InvalidPosttestScore())","v":false},{"$error":"#DIV/0!"},{"$error":"#DIV/0!"},{"$error":"#DIV/0!"},0,0,0,"YES",1,1,0,1,{"$error":"#DIV/0!"}]
[144,null,null,null,{"$f":"IF(D145>$W$3,InvalidPretestScore())","v":false},{"$error":"#DIV/0!"},0,null,{"$f":"IF(H145>$W$4,InvalidPosttestScore())","v":false},{"$error":"#DIV/0!"},{"$error":"#DIV/0!"},{"$error":"#DIV/0!"},0,0,0,"YES",1,1,0,1,{"$error":"#DIV/0!"}]
[145,null,null,null,{"$f":"IF(D146>$W$3,InvalidPretestScore())","v":false},{"$error":"#DIV/0!"},0,null,{"$f":"IF(H146>$W$4,InvalidPosttestScore())","v":false},{"$error":"#DIV/0!"},{"$error":"#DIV/0!"},{"$error":"#DIV/0!"},0,0,0,"YES",1,1,0,1,{"$error":"#DIV/0!"}]
[146,null,null,null,{"$f":"IF(D147>$W$3,InvalidPretestScore())","v":false},{"$error":"#DIV/0!"},0,null,{"$f":"IF(H147>$W$4,InvalidPosttestScore())","v":false},{"$error":"#DIV/0!"},{"$error":"#DIV/0!"},{"$error":"#DIV/0!"},0,0,0,"YES",1,1,0,1,{"$error":"#DIV/0!"}]
[147,null,null,null,{"$f":"IF(D148>$W$3,InvalidPretestScore())","v":false},{"$error":"#DIV/0!"},0,null,{"$f":"IF(H148>$W$4,InvalidPosttestScore())","v":false},{"$error":"#DIV/0!"},{"$error":"#DIV/0!"},{"$error":"#DIV/0!"},0,0,0,"YES",1,1,0,1,{"$error":"#DIV/0!"}]
[148,null,null,null,{"$f":"IF(D149>$W$3,InvalidPretestScore())","v":false},{"$error":"#DIV/0!"},0,null,{"$f":"IF(H149>$W$4,InvalidPosttestScore())","v":false},{"$error":"#DIV/0!"},{"$error":"#DIV/0!"},{"$error":"#DIV/0!"},0,0,0,"YES",1,1,0,1,{"$error":"#DIV/0!"}]
[149,null,null,null,{"$f":"IF(D150>$W$3,InvalidPretestScore())","v":false},{"$error":"#DIV/0!"},0,null,{"$f":"IF(H150>$W$4,InvalidPosttestScore())","v":false},{"$error":"#DIV/0!"},{"$error":"#DIV/0!"},{"$error":"#DIV/0!"},0,0,0,"YES",1,1,0,1,{"$error":"#DIV/0!"}]
[150,null,null,null,{"$f":"IF(D151>$W$3,InvalidPretestScore())","v":false},{"$error":"#DIV/0!"},0,null,{"$f":"IF(H151>$W$4,InvalidPosttestScore())","v":false},{"$error":"#DIV/0!"},{"$error":"#DIV/0!"},{"$error":"#DIV/0!"},0,0,0,"YES",1,1,0,1,{"$error":"#DIV/0!"}]
[151,null,null,null,{"$f":"IF(D152>$W$3,InvalidPretestScore())","v":false},{"$f":"(D152/$W$3)","v":{"$error":"#DIV/0!"}},{"$f":"(($W$3-D152)/2)+D152","v":0},null,{"$f":"IF(H152>$W$4,InvalidPosttestScore())","v":false},{"$f":"H152/$W$4","v":{"$error":"#DIV/0!"}},{"$f":"L152*$W$4","v":{"$error":"#DIV/0!"}},{"$f":"G152/$W$3","v":{"$error":"#DIV/0!"}},0,0,0,"YES",1,1,0,1,{"$f":"IF(AND(J152>=L152),\"YES\",IF(AND(J152<L152,J152>=1%),\"NO\",IF(AND(J152=0%),\"INVALID\")))","v":{"$error":"#DIV/0!"}}]
[152,null,null,null,{"$f":"IF(D153>$W$3,InvalidPretestScore())","v":false},{"$error":"#DIV/0!"},0,null,{"$f":"IF(H153>$W$4,InvalidPosttestScore())","v":false},{"$error":"#DIV/0!"},{"$error":"#DIV/0!"},{"$error":"#DIV/0!"},0,0,0,"YES",1,1,0,1,{"$error":"#DIV/0!"}]
[153,null,null,null,{"$f":"IF(D154>$W$3,InvalidPretestScore())","v":false},{"$error":"#DIV/0!"},0,null,{"$f":"IF(H154>$W$4,InvalidPosttestScore())","v":false},{"$error":"#DIV/0!"},{"$error":"#DIV/0!"},{"$error":"#DIV/0!"},0,0,0,"YES",1,1,0,1,{"$error":"#DIV/0!"}]
[154,null,null,null,{"$f":"IF(D155>$W$3,InvalidPretestScore())","v":false},{"$error":"#DIV/0!"},0,null,{"$f":"IF(H155>$W$4,InvalidPosttestScore())","v":false},{"$error":"#DIV/0!"},{"$error":"#DIV/0!"},{"$error":"#DIV/0!"},0,0,0,"YES",1,1,0,1,{"$error":"#DIV/0!"}]
[155,null,null,null,{"$f":"IF(D156>$W$3,InvalidPretestScore())","v":false},{"$error":"#DIV/0!"},0,null,{"$f":"IF(H156>$W$4,InvalidPosttestScore())","v":false},{"$error":"#DIV/0!"},{"$error":"#DIV/0!"},{"$error":"#DIV/0!"},0,0,0,"YES",1,1,0,1,{"$error":"#DIV/0!"}]
[156,null,null,null,{"$f":"IF(D157>$W$3,InvalidPretestScore())","v":false},{"$error":"#DIV/0!"},0,null,{"$f":"IF(H157>$W$4,InvalidPosttestScore())","v":false},{"$error":"#DIV/0!"},{"$error":"#DIV/0!"},{"$error":"#DIV/0!"},0,0,0,"YES",1,1,0,1,{"$error":"#DIV/0!"}]
[157,null,null,null,{"$f":"IF(D158>$W$3,InvalidPretestScore())","v":false},{"$error":"#DIV/0!"},0,null,{"$f":"IF(H158>$W$4,InvalidPosttestScore())","v":false},{"$error":"#DIV/0!"},{"$error":"#DIV/0!"},{"$error":"#DIV/0!"},0,0,0,"YES",1,1,0,1,{"$error":"#DIV/0!"}]
[158,null,null,null,{"$f":"IF(D159>$W$3,InvalidPretestScore())","v":false},{"$error":"#DIV/0!"},0,null,{"$f":"IF(H159>$W$4,InvalidPosttestScore())","v":false},{"$error":"#DIV/0!"},{"$error":"#DIV/0!"},{"$error":"#DIV/0!"},0,0,0,"YES",1,1,0,1,{"$error":"#DIV/0!"}]
[159,null,null,null,{"$f":"IF(D160>$W$3,InvalidPretestScore())","v":false},{"$error":"#DIV/0!"},0,null,{"$f":"IF(H160>$W$4,InvalidPosttestScore())","v":false},{"$error":"#DIV/0!"},{"$error":"#DIV/0!"},{"$error":"#DIV/0!"},0,0,0,"YES",1,1,0,1,{"$error":"#DIV/0!"}]
[160,null,null,null,{"$f":"IF(D161>$W$3,InvalidPretestScore())","v":false},{"$error":"#DIV/0!"},0,null,{"$f":"IF(H161>$W$4,InvalidPosttestScore())","v":false},{"$error":"#DIV/0!"},{"$error":"#DIV/0!"},{"$error":"#DIV/0!"},0,0,0,"YES",1,1,0,1,{"$error":"#DIV/0!"}]
[161,null,null,null,{"$f":"IF(D162>$W$3,InvalidPretestScore())","v":false},{"$error":"#DIV/0!"},0,null,{"$f":"IF(H162>$W$4,InvalidPosttestScore())","v":false},{"$error":"#DIV/0!"},{"$error":"#DIV/0!"},{"$error":"#DIV/0!"},0,0,0,"YES",1,1,0,1,{"$error":"#DIV/0!"}]
[162,null,null,null,{"$f":"IF(D163>$W$3,InvalidPretestScore())","v":false},{"$error":"#DIV/0!"},0,null,{"$f":"IF(H163>$W$4,InvalidPosttestScore())","v":false},{"$error":"#DIV/0!"},{"$error":"#DIV/0!"},{"$error":"#DIV/0!"},0,0,0,"YES",1,1,0,1,{"$error":"#DIV/0!"}]
[163,null,null,null,{"$f":"IF(D164>$W$3,InvalidPretestScore())","v":false},{"$error":"#DIV/0!"},0,null,{"$f":"IF(H164>$W$4,InvalidPosttestScore())","v":false},{"$error":"#DIV/0!"},{"$error":"#DIV/0!"},{"$error":"#DIV/0!"},0,0,0,"YES",1,1,0,1,{"$error":"#DIV/0!"}]
[164,null,null,null,{"$f":"IF(D165>$W$3,InvalidPretestScore())","v":false},{"$error":"#DIV/0!"},0,null,{"$f":"IF(H165>$W$4,InvalidPosttestScore())","v":false},{"$error":"#DIV/0!"},{"$error":"#DIV/0!"},{"$error":"#DIV/0!"},0,0,0,"YES",1,1,0,1,{"$error":"#DIV/0!"}]
[165,null,null,null,{"$f":"IF(D166>$W$3,InvalidPretestScore())","v":false},{"$error":"#DIV/0!"},0,null,{"$f":"IF(H166>$W$4,InvalidPosttestScore())","v":false},{"$error":"#DIV/0!"},{"$error":"#DIV/0!"},{"$error":"#DIV/0!"},0,0,0,"YES",1,1,0,1,{"$error":"#DIV/0!"}]
[166,null,null,null,{"$f":"IF(D167>$W$3,InvalidPretestScore())","v":false},{"$error":"#DIV/0!"},0,null,{"$f":"IF(H167>$W$4,InvalidPosttestScore())","v":false},{"$error":"#DIV/0!"},{"$error":"#DIV/0!"},{"$error":"#DIV/0!"},0,0,0,"YES",1,1,0,1,{"$error":"#DIV/0!"}]
[167,null,null,null,{"$f":"IF(D168>$W$3,InvalidPretestScore())","v":false},{"$error":"#DIV/0!"},0,null,{"$f":"IF(H168>$W$4,InvalidPosttestScore())","v":false},{"$error":"#DIV/0!"},{"$error":"#DIV/0!"},{"$error":"#DIV/0!"},0,0,0,"YES",1,1,0,1,{"$error":"#DIV/0!"}]
[168,null,null,null,{"$f":"IF(D169>$W$3,InvalidPretestScore())","v":false},{"$error":"#DIV/0!"},0,null,{"$f":"IF(H169>$W$4,InvalidPosttestScore())","v":false},{"$error":"#DIV/0!"},{"$error":"#DIV/0!"},{"$error":"#DIV/0!"},0,0,0,"YES",1,1,0,1,{"$error":"#DIV/0!"}]
[169,null,null,null,{"$f":"IF(D170>$W$3,InvalidPretestScore())","v":false},{"$error":"#DIV/0!"},0,null,{"$f":"IF(H170>$W$4,InvalidPosttestScore())","v":false},{"$error":"#DIV/0!"},{"$error":"#DIV/0!"},{"$error":"#DIV/0!"},0,0,0,"YES",1,1,0,1,{"$error":"#DIV/0!"}]
[170,null,null,null,{"$f":"IF(D171>$W$3,InvalidPretestScore())","v":false},{"$error":"#DIV/0!"},0,null,{"$f":"IF(H171>$W$4,InvalidPosttestScore())","v":false},{"$error":"#DIV/0!"},{"$error":"#DIV/0!"},{"$error":"#DIV/0!"},0,0,0,"YES",1,1,0,1,{"$error":"#DIV/0!"}]
[171,null,null,null,{"$f":"IF(D172>$W$3,InvalidPretestScore())","v":false},{"$error":"#DIV/0!"},0,null,{"$f":"IF(H172>$W$4,InvalidPosttestScore())","v":false},{"$error":"#DIV/0!"},{"$error":"#DIV/0!"},{"$error":"#DIV/0!"},0,0,0,"YES",1,1,0,1,{"$error":"#DIV/0!"}]
[172,null,null,null,{"$f":"IF(D173>$W$3,InvalidPretestScore())","v":false},{"$error":"#DIV/0!"},0,null,{"$f":"IF(H173>$W$4,InvalidPosttestScore())","v":false},{"$error":"#DIV/0!"},{"$error":"#DIV/0!"},{"$error":"#DIV/0!"},0,0,0,"YES",1,1,0,1,{"$error":"#DIV/0!"}]
[173,null,null,null,{"$f":"IF(D174>$W$3,InvalidPretestScore())","v":false},{"$error":"#DIV/0!"},0,null,{"$f":"IF(H174>$W$4,InvalidPosttestScore())","v":false},{"$error":"#DIV/0!"},{"$error":"#DIV/0!"},{"$error":"#DIV/0!"},0,0,0,"YES",1,1,0,1,{"$error":"#DIV/0!"}]
[174,null,null,null,{"$f":"IF(D175>$W$3,InvalidPretestScore())","v":false},{"$error":"#DIV/0!"},0,null,{"$f":"IF(H175>$W$4,InvalidPosttestScore())","v":false},{"$error":"#DIV/0!"},{"$error":"#DIV/0!"},{"$error":"#DIV/0!"},0,0,0,"YES",1,1,0,1,{"$error":"#DIV/0!"}]
[175,null,null,null,{"$f":"IF(D176>$W$3,InvalidPretestScore())","v":false},{"$error":"#DIV/0!"},0,null,{"$f":"IF(H176>$W$4,InvalidPosttestScore())","v":false},{"$error":"#DIV/0!"},{"$error":"#DIV/0!"},{"$error":"#DIV/0!"},0,0,0,"YES",1,1,0,1,{"$error":"#DIV/0!"}]
[176,null,null,null,{"$f":"IF(D177>$W$3,InvalidPretestScore())","v":false},{"$error":"#DIV/0!"},0,null,{"$f":"IF(H177>$W$4,InvalidPosttestScore())","v":false},{"$error":"#DIV/0!"},{"$error":"#DIV/0!"},{"$error":"#DIV/0!"},0,0,0,"YES",1,1,0,1,{"$error":"#DIV/0!"}]
[177,null,null,null,{"$f":"IF(D178>$W$3,InvalidPretestScore())","v":false},{"$error":"#DIV/0!"},0,null,{"$f":"IF(H178>$W$4,InvalidPosttestScore())","v":false},{"$error":"#DIV/0!"},{"$error":"#DIV/0!"},{"$error":"#DIV/0!"},0,0,0,"YES",1,1,0,1,{"$error":"#DIV/0!"}]
[178,null,null,null,{"$f":"IF(D179>$W$3,InvalidPretestScore())","v":false},{"$f":"(D179/$W$3)","v":{"$error":"#DIV/0!"}},{"$f":"(($W$3-D179)/2)+D179","v":0},null,{"$f":"IF(H179>$W$4,InvalidPosttestScore())","v":false},{"$f":"H179/$W$4","v":{"$error":"#DIV/0!"}},{"$f":"L179*$W$4","v":{"$error":"#DIV/0!"}},{"$f":"G179/$W$3","v":{"$error":"#DIV/0!"}},0,0,0,"YES",1,1,0,1,{"$f":"IF(AND(J179>=L179),\"YES\",IF(AND(J179<L179,J179>=1%),\"NO\",IF(AND(J179=0%),\"INVALID\")))","v":{"$error":"#DIV/0!"}}]
[179,null,null,null,{"$f":"IF(D180>$W$3,InvalidPretestScore())","v":false},{"$f":"(D180/$W$3)","v":{"$error":"#DIV/0!"}},{"$f":"(($W$3-D180)/2)+D180","v":0},null,{"$f":"IF(H180>$W$4,InvalidPosttestScore())","v":false},{"$f":"H180/$W$4","v":{"$error":"#DIV/0!"}},{"$f":"L180*$W$4","v":{"$error":"#DIV/0!"}},{"$f":"G180/$W$3","v":{"$error":"#DIV/0!"}},0,0,0,"YES",1,1,0,1,{"$f":"IF(AND(J180>=L180),\"YES\",IF(AND(J180<L180,J180>=1%),\"NO\",IF(AND(J180=0%),\"INVALID\")))","v":{"$error":"#DIV/0!"}}]
[180,null,null,null,{"$f":"IF(D181>$W$3,InvalidPretestScore())","v":false},{"$f":"(D181/$W$3)","v":{"$error":"#DIV/0!"}},{"$f":"(($W$3-D181)/2)+D181","v":0},null,{"$f":"IF(H181>$W$4,InvalidPosttestScore())","v":false},{"$f":"H181/$W$4","v":{"$error":"#DIV/0!"}},{"$f":"L181*$W$4","v":{"$error":"#DIV/0!"}},{"$f":"G181/$W$3","v":{"$error":"#DIV/0!"}},0,0,0,"YES",1,1,0,1,{"$f":"IF(AND(J181>=L181),\"YES\",IF(AND(J181<L181,J181>=1%),\"NO\",IF(AND(J181=0%),\"INVALID\")))","v":{"$error":"#DIV/0!"}}]
[]
[]
[]
[]
["After approval from your evaluator, enter the names of students whose data will not be used with a brief explanation why."]
[null,"Last Name","First Name","Reason for removing student from evaluative data"]
[null,{"$f":"IF(P2=\"no\", B2, \"DELETE\")","v":"DELETE"},{"$f":"IF(P2=\"no\", C2,\"DELETE\")","v":"DELETE"}]
[null,{"$f":"IF(P3=\"no\", B3, \"DELETE\")","v":"DELETE"},{"$f":"IF(P3=\"no\", C3,\"DELETE\")","v":"DELETE"}]
[null,"DELETE","DELETE"]
[null,"DELETE","DELETE"]
[null,"DELETE","DELETE"]
[null,"DELETE","DELETE"]
[null,"DELETE","DELETE"]
[null,"DELETE","DELETE"]
[null,"DELETE","DELETE"]
[null,"DELETE","DELETE"]
[null,"DELETE","DELETE"]
[null,"DELETE","DELETE"]
[null,"DELETE","DELETE"]
[null,"DELETE","DELETE"]
[null,"DELETE","DELETE"]
[null,"DELETE","DELETE"]
[null,"DELETE","DELETE"]
[null,"DELETE","DELETE"]
[null,"DELETE","DELETE"]
[null,"DELETE","DELETE"]
[null,"DELETE","DELETE"]
[null,"DELETE","DELETE"]
[null,"DELETE","DELETE"]
[null,"DELETE","DELETE"]
[null,"DELETE","DELETE"]
[null,"DELETE","DELETE"]
[null,"DELETE","DELETE"]
[null,"DELETE","DELETE"]
[null,"DELETE","DELETE"]
[null,"DELETE","DELETE"]
[null,"DELETE","DELETE"]
[null,"DELETE","DELETE"]
[null,"DELETE","DELETE"]
[null,"DELETE","DELETE"]
[null,"DELETE","DELETE"]
[null,"DELETE","DELETE"]
[null,"DELETE","DELETE"]
[null,"DELETE","DELETE"]
[null,"DELETE","DELETE"]
[null,"DELETE","DELETE"]
[null,"DELETE","DELETE"]
[null,"DELETE","DELETE"]
[null,"DELETE","DELETE"]
[null,"DELETE","DELETE"]
[null,"DELETE","DELETE"]
[null,"DELETE","DELETE"]
[null,"DELETE","DELETE"]
[null,"DELETE","DELETE"]
[null,"DELETE","DELETE"]
[null,"DELETE","DELETE"]
[null,"DELETE","DELETE"]
[null,"DELETE","DELETE"]
[null,"DELETE","DELETE"]
[null,"DELETE","DELETE"]
[null,"DELETE","DELETE"]
[null,"DELETE","DELETE"]
[null,"DELETE","DELETE"]
[null,"DELETE","DELETE"]
[null,"DELETE","DELETE"]
[null,"DELETE","DELETE"]
[null,"DELETE","DELETE"]
[null,"DELETE","DELETE"]
[null,"DELETE","DELETE"]
[null,"DELETE","DELETE"]
[null,"DELETE","DELETE"]
[null,{"$f":"IF(P67=\"no\", B67, \"DELETE\")","v":"DELETE"},{"$f":"IF(P67=\"no\", C67,\"DELETE\")","v":"DELETE"}]
[null,"DELETE","DELETE"]
[null,"DELETE","DELETE"]
[null,"DELETE","DELETE"]
[null,"DELETE","DELETE"]
[null,"DELETE","DELETE"]
[null,"DELETE","DELETE"]
[null,"DELETE","DELETE"]
[null,"DELETE","DELETE"]
[null,"DELETE","DELETE"]
[null,"DELETE","DELETE"]
[null,"DELETE","DELETE"]
[null,"DELETE","DELETE"]
[null,"DELETE","DELETE"]
[null,"DELETE","DELETE"]
[null,"DELETE","DELETE"]
[null,"DELETE","DELETE"]
[null,"DELETE","DELETE"]
[null,"DELETE","DELETE"]
[null,"DELETE","DELETE"]
[null,"DELETE","DELETE"]
[null,"DELETE","DELETE"]
[null,"DELETE","DELETE"]
[null,"DELETE","DELETE"]
[null,"DELETE","DELETE"]
[null,"DELETE","DELETE"]
[null,"DELETE","DELETE"]
[null,"DELETE","DELETE"]
[null,"DELETE","DELETE"]
[null,"DELETE","DELETE"]
[null,"DELETE","DELETE"]
[null,"DELETE","DELETE"]
[null,"DELETE","DELETE"]
[null,"DELETE","DELETE"]
[null,"DELETE","DELETE"]
[null,"DELETE","DELETE"]
[null,"DELETE","DELETE"]
[null,"DELETE","DELETE"]
[null,"DELETE","DELETE"]
[null,"DELETE","DELETE"]
[null,"DELETE","DELETE"]
[null,"DELETE","DELETE"]
[null,"DELETE","DELETE"]
[null,"DELETE","DELETE"]
[null,"DELETE","DELETE"]
[null,"DELETE","DELETE"]
[null,"DELETE","DELETE"]
[null,"DELETE","DELETE"]
[null,"DELETE","DELETE"]
[null,"DELETE","DELETE"]
[null,"DELETE","DELETE"]
[null,"DELETE","DELETE"]
[null,"DELETE","DELETE"]
[null,"DELETE","DELETE"]
[null,"DELETE","DELETE"]
[null,"DELETE","DELETE"]
[null,"DELETE","DELETE"]
[null,"DELETE","DELETE"]
[null,"DELETE","DELETE"]
[null,"DELETE","DELETE"]
[null,"DELETE","DELETE"]
[null,"DELETE","DELETE"]
[null,"DELETE","DELETE"]
[null,"DELETE","DELETE"]
[null,{"$f":"IF(P131=\"no\", B131, \"DELETE\")","v":"DELETE"},{"$f":"IF(P131=\"no\", C131,\"DELETE\")","v":"DELETE"}]
[null,"DELETE","DELETE"]
[null,"DELETE","DELETE"]
[null,"DELETE","DELETE"]
[null,"DELETE","DELETE"]
[null,"DELETE","DELETE"]
[null,"DELETE","DELETE"]
[null,"DELETE","DELETE"]
[null,"DELETE","DELETE"]
[null,"DELETE","DELETE"]
[null,"DELETE","DELETE"]
[null,"DELETE","DELETE"]
[null,"DELETE","DELETE"]
[null,"DELETE","DELETE"]
[null,"DELETE","DELETE"]
[null,"DELETE","DELETE"]
[null,"DELETE","DELETE"]
[null,"DELETE","DELETE"]
[null,"DELETE","DELETE"]
[null,"DELETE","DELETE"]
[null,"DELETE","DELETE"]
[null,"DELETE","DELETE"]
[null,"DELETE","DELETE"]
[null,"DELETE","DELETE"]
[null,"DELETE","DELETE"]
[null,"DELETE","DELETE"]
[null,"DELETE","DELETE"]
[null,"DELETE","DELETE"]
[null,"DELETE","DELETE"]
[null,"DELETE","DELETE"]
[null,"DELETE","DELETE"]
[null,"DELETE","DELETE"]
[null,"DELETE","DELETE"]
[null,"DELETE","DELETE"]
[null,"DELETE","DELETE"]
[null,"DELETE","DELETE"]
[null,"DELETE","DELETE"]
[null,"DELETE","DELETE"]
[null,"DELETE","DELETE"]
[null,"DELETE","DELETE"]
[null,"DELETE","DELETE"]
[null,"DELETE","DELETE"]
[null,"DELETE","DELETE"]
[null,"DELETE","DELETE"]
[null,"DELETE","DELETE"]
[null,"DELETE","DELETE"]
[null,"DELETE","DELETE"]
[null,"DELETE","DELETE"]
[null,"DELETE","DELETE"]
[null,"DELETE","DELETE"]
[null,"DELETE","DELETE"]
[null,"DELETE","DELETE"]

{"sheet":"Sheet2","index":1,"n_rows":29,"n_cols":1,"rows_kept":29,"cut":false,"hidden":false,"merged":[]}
[{"$f":"IF(Sheet1!P2=\"no\",Sheet1!B2)","v":false}]
[{"$f":"IF(Sheet1!P3=\"no\",Sheet1!B3)","v":false}]
[{"$f":"IF(Sheet1!P4=\"no\",Sheet1!B4)","v":false}]
[{"$f":"IF(Sheet1!P5=\"no\",Sheet1!B5)","v":false}]
[{"$f":"IF(Sheet1!P6=\"no\",Sheet1!B6)","v":false}]
[{"$f":"IF(Sheet1!P7=\"no\",Sheet1!B7)","v":false}]
[{"$f":"IF(Sheet1!P8=\"no\",Sheet1!B8)","v":false}]
[{"$f":"IF(Sheet1!P9=\"no\",Sheet1!B9)","v":false}]
[{"$f":"IF(Sheet1!P10=\"no\",Sheet1!B10)","v":false}]
[{"$f":"IF(Sheet1!P11=\"no\",Sheet1!B11)","v":false}]
[{"$f":"IF(Sheet1!P12=\"no\",Sheet1!B12)","v":false}]
[{"$f":"IF(Sheet1!P13=\"no\",Sheet1!B13)","v":false}]
[{"$f":"IF(Sheet1!P14=\"no\",Sheet1!B14)","v":false}]
[{"$f":"IF(Sheet1!P15=\"no\",Sheet1!B15)","v":false}]
[{"$f":"IF(Sheet1!P16=\"no\",Sheet1!B16)","v":false}]
[{"$f":"IF(Sheet1!P17=\"no\",Sheet1!B17)","v":false}]
[{"$f":"IF(Sheet1!P18=\"no\",Sheet1!B18)","v":false}]
[{"$f":"IF(Sheet1!P19=\"no\",Sheet1!B19)","v":false}]
[{"$f":"IF(Sheet1!P20=\"no\",Sheet1!B20)","v":false}]
[{"$f":"IF(Sheet1!P21=\"no\",Sheet1!B21)","v":false}]
[{"$f":"IF(Sheet1!P22=\"no\",Sheet1!B22)","v":false}]
[{"$f":"IF(Sheet1!P23=\"no\",Sheet1!B23)","v":false}]
[{"$f":"IF(Sheet1!P24=\"no\",Sheet1!B24)","v":false}]
[{"$f":"IF(Sheet1!P25=\"no\",Sheet1!B25)","v":false}]
[{"$f":"IF(Sheet1!P26=\"no\",Sheet1!B26)","v":false}]
[{"$f":"IF(Sheet1!P27=\"no\",Sheet1!B27)","v":false}]
[{"$f":"IF(Sheet1!P28=\"no\",Sheet1!B28)","v":false}]
[{"$f":"IF(Sheet1!P29=\"no\",Sheet1!B29)","v":false}]
[{"$f":"IF(Sheet1!P30=\"no\",Sheet1!B30)","v":false}]

{"sheet":"Sheet3","index":2,"n_rows":0,"n_cols":0,"rows_kept":0,"cut":false,"hidden":false,"merged":[]}