{"text_format":"1","workbook":"xlsx","n_sheets":3,"sheets":["Sheet1","Sheet2","Sheet3"],"not_rendered":{"charts":0,"images":0,"macros":1,"external_links":0,"defined_names":0,"comments":0,"pivot_tables":0},"unopened":[],"bounds":{"document_bytes":16777216,"sheet_cells":100000,"rows_first":2000,"rows_last":500,"rows_between":2000,"halvings":0,"cell_chars":16384,"cell_head_chars":4096},"cells_cut":0,"cells_raw":0,"read":"whole","date_system":"1900"}

{"sheet":"Sheet1","index":0,"n_rows":369,"n_cols":12,"rows_kept":369,"cut":false,"hidden":false,"merged":[[363,4,363,6],[367,4,367,6],[368,4,368,6],[358,4,358,6],[359,4,359,6],[360,4,360,6],[361,4,361,6],[362,4,362,6],[353,4,353,6],[354,4,354,6],[355,4,355,6],[356,4,356,6],[357,4,357,6],[366,4,366,6],[364,4,364,6],[365,4,365,6],[348,4,348,6],[349,4,349,6],[350,4,350,6],[351,4,351,6],[352,4,352,6],[343,4,343,6],[344,4,344,6],[345,4,345,6],[346,4,346,6],[347,4,347,6],[338,4,338,6],[339,4,339,6],[340,4,340,6],[341,4,341,6],[342,4,342,6],[333,4,333,6],[334,4,334,6],[335,4,335,6],[336,4,336,6],[337,4,337,6],[328,4,328,6],[329,4,329,6],[330,4,330,6],[331,4,331,6],[332,4,332,6],[323,4,323,6],[324,4,324,6],[325,4,325,6],[326,4,326,6],[327,4,327,6],[318,4,318,6],[319,4,319,6],[320,4,320,6],[321,4,321,6],[322,4,322,6],[313,4,313,6],[314,4,314,6],[315,4,315,6],[316,4,316,6],[317,4,317,6],[308,4,308,6],[309,4,309,6],[310,4,310,6],[311,4,311,6],[312,4,312,6],[303,4,303,6],[304,4,304,6],[305,4,305,6],[306,4,306,6],[307,4,307,6],[298,4,298,6],[299,4,299,6],[300,4,300,6],[301,4,301,6],[302,4,302,6],[293,4,293,6],[294,4,294,6],[295,4,295,6],[296,4,296,6],[297,4,297,6],[288,4,288,6],[289,4,289,6],[290,4,290,6],[291,4,291,6],[292,4,292,6],[284,4,284,6],[285,4,285,6],[286,4,286,6],[287,4,287,6],[283,4,283,6],[266,4,266,6],[267,4,267,6],[258,4,258,6],[259,4,259,6],[260,4,260,6],[261,4,261,6],[262,4,262,6],[273,4,273,6],[274,4,274,6],[278,4,278,6],[279,4,279,6],[280,4,280,6],[281,4,281,6],[282,4,282,6],[275,4,275,6],[276,4,276,6],[277,4,277,6],[268,4,268,6],[269,4,269,6],[270,4,270,6],[271,4,271,6],[272,4,272,6],[257,4,257,6],[248,4,248,6],[249,4,249,6],[250,4,250,6],[251,4,251,6],[252,4,252,6],[263,4,263,6],[264,4,264,6],[265,4,265,6],[238,4,238,6],[239,4,239,6],[240,4,240,6],[241,4,241,6],[242,4,242,6],[253,4,253,6],[254,4,254,6],[255,4,255,6],[256,4,256,6],[243,4,243,6],[244,4,244,6],[245,4,245,6],[246,4,246,6],[247,4,247,6],[196,4,196,6],[223,4,223,6],[224,4,224,6],[225,4,225,6],[226,4,226,6],[227,4,227,6],[218,4,218,6],[219,4,219,6],[220,4,220,6],[221,4,221,6],[222,4,222,6],[213,4,213,6],[214,4,214,6],[215,4,215,6],[216,4,216,6],[217,4,217,6],[212,4,212,6],[188,4,188,6],[187,0,187,6],[210,4,210,6],[211,4,211,6],[204,4,204,6],[205,4,205,6],[206,4,206,6],[207,4,207,6],[208,4,208,6],[209,4,209,6],[189,4,189,6],[190,4,190,6],[191,4,191,6],[192,4,192,6],[193,4,193,6],[194,4,194,6],[195,4,195,6],[197,4,197,6],[198,4,198,6],[199,4,199,6],[200,4,200,6],[202,4,202,6],[201,4,201,6],[203,4,203,6],[233,4,233,6],[234,4,234,6],[235,4,235,6],[236,4,236,6],[237,4,237,6],[228,4,228,6],[229,4,229,6],[230,4,230,6],[231,4,231,6],[232,4,232,6]]}
["Grade 3 Primary Measure"]
[null,"Last Name","First Name","Target Met?","Score Counted for Data",null,null,null,"Not Blank Record flag","Passed? Counter","Score Counted for Data Counter","Passed and Counted counter"]
[1,null,null,"YES","YES","Teacher",null,"YES",{"$f":"COUNTA(B3)","v":0},{"$f":"COUNTIF(D3,\"YES\")","v":1},{"$f":"COUNTIF(E3,\"YES\")","v":1},{"$f":"I3+J3+K3","v":2}]
[2,null,null,"YES","YES","Total Tested",{"$f":"COUNTA(B3:B182)","v":0},"NO",{"$f":"COUNTA(B4)","v":0},{"$f":"COUNTIF(D4,\"YES\")","v":1},{"$f":"COUNTIF(E4,\"YES\")","v":1},{"$f":"I4+J4+K4","v":2}]
[3,null,null,"YES","YES","Total Excluded",{"$f":"COUNTIF(E:E, \"NO\")","v":0},null,0,1,1,2]
[4,null,null,"YES","YES","Total Counted",{"$f":"G4-G5","v":0},null,0,1,1,2]
[5,null,null,"YES","YES","Total Met Target (Counted)",{"$f":"COUNTIF(L3:L182,3)","v":0},null,0,1,1,2]
[6,null,null,"YES","YES","Total Did not Meet Target (Counted)",{"$f":"G6-G7","v":0},null,0,1,1,2]
[7,null,null,"YES","YES","% Passed (Counted)",{"$f":"G7/G6","v":{"$error":"#DIV/0!"}},null,0,1,1,2]
[8,null,null,"YES","YES",null,null,null,0,1,1,2]
[9,null,null,"YES","YES",null,null,null,0,1,1,2]
[10,null,null,"YES","YES",null,null,null,0,1,1,2]
[11,null,null,"YES","YES",null,null,null,0,1,1,2]
[12,null,null,"YES","YES",null,null,null,0,1,1,2]
[13,null,null,"YES","YES",null,null,null,0,1,1,2]
[14,null,null,"YES","YES",null,null,null,0,1,1,2]
[15,null,null,"YES","YES",null,null,null,0,1,1,2]
[16,null,null,"YES","YES",null,null,null,0,1,1,2]
[17,null,null,"YES","YES",null,null,null,0,1,1,2]
[18,null,null,"YES","YES",null,null,null,0,1,1,2]
[19,null,null,"YES","YES",null,null,null,0,1,1,2]
[20,null,null,"YES","YES",null,null,null,0,1,1,2]
[21,null,null,"YES","YES",null,null,null,0,1,1,2]
[22,null,null,"YES","YES",null,null,null,0,1,1,2]
[23,null,null,"YES","YES",null,null,null,0,1,1,2]
[24,null,null,"YES","YES",null,null,null,0,1,1,2]
[25,null,null,"YES","YES",null,null,null,0,1,1,2]
[26,null,null,"YES","YES",null,null,null,0,1,1,2]
[27,null,null,"YES","YES",null,null,null,0,1,1,2]
[28,null,null,"YES","YES",null,null,null,0,1,1,2]
[29,null,null,"YES","YES",null,null,null,0,1,1,2]
[30,null,null,"YES","YES",null,null,null,0,1,1,2]
[31,null,null,"YES","YES",null,null,null,0,1,1,2]
[32,null,null,"YES","YES",null,null,null,0,1,1,2]
[33,null,null,"YES","YES",null,null,null,0,1,1,2]
[34,null,null,"YES","YES",null,null,null,0,1,1,2]
[35,null,null,"YES","YES",null,null,null,0,1,1,2]
[36,null,null,"YES","YES",null,null,null,0,1,1,2]
[37,null,null,"YES","YES",null,null,null,0,1,1,2]
[38,null,null,"YES","YES",null,null,null,0,1,1,2]
[39,null,null,"YES","YES",null,null,null,0,1,1,2]
[40,null,null,"YES","YES",null,null,null,0,1,1,2]
[41,null,null,"YES","YES",null,null,null,0,1,1,2]
[42,null,null,"YES","YES",null,null,null,0,1,1,2]
[43,null,null,"YES","YES",null,null,null,0,1,1,2]
[44,null,null,"YES","YES",null,null,null,0,1,1,2]
[45,null,null,"YES","YES",null,null,null,0,1,1,2]
[46,null,null,"YES","YES",null,null,null,0,1,1,2]
[47,null,null,"YES","YES",null,null,null,0,1,1,2]
[48,null,null,"YES","YES",null,null,null,0,1,1,2]
[49,null,null,"YES","YES",null,null,null,0,1,1,2]
[50,null,null,"YES","YES",null,null,null,0,1,1,2]
[51,null,null,"YES","YES",null,null,null,0,1,1,2]
[52,null,null,"YES","YES",null,null,null,0,1,1,2]
[53,null,null,"YES","YES",null,null,null,0,1,1,2]
[54,null,null,"YES","YES",null,null,null,0,1,1,2]
[55,null,null,"YES","YES",null,null,null,0,1,1,2]
[56,null,null,"YES","YES",null,null,null,0,1,1,2]
[57,null,null,"YES","YES",null,null,null,0,1,1,2]
[58,null,null,"YES","YES",null,null,null,0,1,1,2]
[59,null,null,"YES","YES",null,null,null,0,1,1,2]
[60,null,null,"YES","YES",null,null,null,0,1,1,2]
[61,null,null,"YES","YES",null,null,null,0,1,1,2]
[62,null,null,"YES","YES",null,null,null,0,1,1,2]
[63,null,null,"YES","YES",null,null,null,0,1,1,2]
[64,null,null,"YES","YES",null,null,null,0,1,1,2]
[65,null,null,"YES","YES",null,null,null,0,1,1,2]
[66,null,null,"YES","YES",null,null,null,{"$f":"COUNTA(B68)","v":0},{"$f":"COUNTIF(D68,\"YES\")","v":1},{"$f":"COUNTIF(E68,\"YES\")","v":1},{"$f":"I68+J68+K68","v":2}]
[67,null,null,"YES","YES",null,null,null,0,1,1,2]
[68,null,null,"YES","YES",null,null,null,0,1,1,2]
[69,null,null,"YES","YES",null,null,null,0,1,1,2]
[70,null,null,"YES","YES",null,null,null,0,1,1,2]
[71,null,null,"YES","YES",null,null,null,0,1,1,2]
[72,null,null,"YES","YES",null,null,null,0,1,1,2]
[73,null,null,"YES","YES",null,null,null,0,1,1,2]
[74,null,null,"YES","YES",null,null,null,0,1,1,2]
[75,null,null,"YES","YES",null,null,null,0,1,1,2]
[76,null,null,"YES","YES",null,null,null,0,1,1,2]
[77,null,null,"YES","YES",null,null,null,0,1,1,2]
[78,null,null,"YES","YES",null,null,null,0,1,1,2]
[79,null,null,"YES","YES",null,null,null,0,1,1,2]
[80,null,null,"YES","YES",null,null,null,0,1,1,2]
[81,null,null,"YES","YES",null,null,null,0,1,1,2]
[82,null,null,"YES","YES",null,null,null,0,1,1,2]
[83,null,null,"YES","YES",null,null,null,0,1,1,2]
[84,null,null,"YES","YES",null,null,null,0,1,1,2]
[85,null,null,"YES","YES",null,null,null,0,1,1,2]
[86,null,null,"YES","YES",null,null,null,0,1,1,2]
[87,null,null,"YES","YES",null,null,null,0,1,1,2]
[88,null,null,"YES","YES",null,null,null,0,1,1,2]
[89,null,null,"YES","YES",null,null,null,0,1,1,2]
[90,null,null,"YES","YES",null,null,null,0,1,1,2]
[91,null,null,"YES","YES",null,null,null,0,1,1,2]
[92,null,null,"YES","YES",null,null,null,0,1,1,2]
[93,null,null,"YES","YES",null,null,null,0,1,1,2]
[94,null,null,"YES","YES",null,null,null,0,1,1,2]
[95,null,null,"YES","YES",null,null,null,0,1,1,2]
[96,null,null,"YES","YES",null,null,null,0,1,1,2]
[97,null,null,"YES","YES",null,null,null,0,1,1,2]
[98,null,null,"YES","YES",null,null,null,0,1,1,2]
[99,null,null,"YES","YES",null,null,null,0,1,1,2]
[100,null,null,"YES","YES",null,null,null,0,1,1,2]
[101,null,null,"YES","YES",null,null,null,0,1,1,2]
[102,null,null,"YES","YES",null,null,null,0,1,1,2]
[103,null,null,"YES","YES",null,null,null,0,1,1,2]
[104,null,null,"YES","YES",null,null,null,0,1,1,2]
[105,null,null,"YES","YES",null,null,null,0,1,1,2]
[106,null,null,"YES","YES",null,null,null,0,1,1,2]
[107,null,null,"YES","YES",null,null,null,0,1,1,2]
[108,null,null,"YES","YES",null,null,null,0,1,1,2]
[109,null,null,"YES","YES",null,null,null,0,1,1,2]
[110,null,null,"YES","YES",null,null,null,0,1,1,2]
[111,null,null,"YES","YES",null,null,null,0,1,1,2]
[112,null,null,"YES","YES",null,null,null,0,1,1,2]
[113,null,null,"YES","YES",null,null,null,0,1,1,2]
[114,null,null,"YES","YES",null,null,null,0,1,1,2]
[115,null,null,"YES","YES",null,null,null,0,1,1,2]
[116,null,null,"YES","YES",null,null,null,0,1,1,2]
[117,null,null,"YES","YES",null,null,null,0,1,1,2]
[118,null,null,"YES","YES",null,null,null,0,1,1,2]
[119,null,null,"YES","YES",null,null,null,0,1,1,2]
[120,null,null,"YES","YES",null,null,null,0,1,1,2]
[121,null,null,"YES","YES",null,null,null,0,1,1,2]
[122,null,null,"YES","YES",null,null,null,0,1,1,2]
[123,null,null,"YES","YES",null,null,null,0,1,1,2]
[124,null,null,"YES","YES",null,null,null,0,1,1,2]
[125,null,null,"YES","YES",null,null,null,0,1,1,2]
[126,null,null,"YES","YES",null,null,null,0,1,1,2]
[127,null,null,"YES","YES",null,null,null,0,1,1,2]
[128,null,null,"YES","YES",null,null,null,0,1,1,2]
[129,null,null,"YES","YES",null,null,null,0,1,1,2]
[130,null,null,"YES","YES",null,null,null,{"$f":"COUNTA(B132)","v":0},{"$f":"COUNTIF(D132,\"YES\")","v":1},{"$f":"COUNTIF(E132,\"YES\")","v":1},{"$f":"I132+J132+K132","v":2}]
[131,null,null,"YES","YES",null,null,null,0,1,1,2]
[132,null,null,"YES","YES",null,null,null,0,1,1,2]
[133,null,null,"YES","YES",null,null,null,0,1,1,2]
[134,null,null,"YES","YES",null,null,null,0,1,1,2]
[135,null,null,"YES","YES",null,null,null,0,1,1,2]
[136,null,null,"YES","YES",null,null,null,0,1,1,2]
[137,null,null,"YES","YES",null,null,null,0,1,1,2]
[138,null,null,"YES","YES",null,null,null,0,1,1,2]
[139,null,null,"YES","YES",null,null,null,0,1,1,2]
[140,null,null,"YES","YES",null,null,null,0,1,1,2]
[141,null,null,"YES","YES",null,null,null,0,1,1,2]
[142,null,null,"YES","YES",null,null,null,0,1,1,2]
[143,null,null,"YES","YES",null,null,null,0,1,1,2]
[144,null,null,"YES","YES",null,null,null,0,1,1,2]
[145,null,null,"YES","YES",null,null,null,0,1,1,2]
[146,null,null,"YES","YES",null,null,null,0,1,1,2]
[147,null,null,"YES","YES",null,null,null,0,1,1,2]
[148,null,null,"YES","YES",null,null,null,0,1,1,2]
[149,null,null,"YES","YES",null,null,null,0,1,1,2]
[150,null,null,"YES","YES",null,null,null,0,1,1,2]
[151,null,null,"YES","YES",null,null,null,0,1,1,2]
[152,null,null,"YES","YES",null,null,null,0,1,1,2]
[153,null,null,"YES","YES",null,null,null,0,1,1,2]
[154,null,null,"YES","YES",null,null,null,0,1,1,2]
[155,null,null,"YES","YES",null,null,null,0,1,1,2]
[156,null,null,"YES","YES",null,null,null,0,1,1,2]
[157,null,null,"YES","YES",null,null,null,0,1,1,2]
[158,null,null,"YES","YES",null,null,null,0,1,1,2]
[159,null,null,"YES","YES",null,null,null,0,1,1,2]
[160,null,null,"YES","YES",null,null,null,0,1,1,2]
[161,null,null,"YES","YES",null,null,null,0,1,1,2]
[162,null,null,"YES","YES",null,null,null,0,1,1,2]
[163,null,null,"YES","YES",null,null,null,0,1,1,2]
[164,null,null,"YES","YES",null,null,null,0,1,1,2]
[165,null,null,"YES","YES",null,null,null,0,1,1,2]
[166,null,null,"YES","YES",null,null,null,0,1,1,2]
[167,null,null,"YES","YES",null,null,null,0,1,1,2]
[168,null,null,"YES","YES",null,null,null,0,1,1,2]
[169,null,null,"YES","YES",null,null,null,0,1,1,2]
[170,null,null,"YES","YES",null,null,null,0,1,1,2]
[171,null,null,"YES","YES",null,null,null,0,1,1,2]
[172,null,null,"YES","YES",null,null,null,0,1,1,2]
[173,null,null,"YES","YES",null,null,null,0,1,1,2]
[174,null,null,"YES","YES",null,null,null,0,1,1,2]
[175,null,null,"YES","YES",null,null,null,0,1,1,2]
[176,null,null,"YES","YES",null,null,null,0,1,1,2]
[177,null,null,"YES","YES",null,null,null,0,1,1,2]
[178,null,null,"YES","YES",null,null,null,0,1,1,2]
[179,null,null,"YES","YES",null,null,null,0,1,1,2]
[180,null,null,"YES","YES",null,null,null,0,1,1,2]
[]
[]
[]
[]
[]
["After approval from your evaluator, enter the names of students whose data will not be used with a brief explanation why."]
[null,"Last Name","First Name","SGP","Reason for removing student from evaluative data"]
[null,{"$f":"IF(E3=\"NO\",B3,\"DELETE\")","v":"DELETE"},{"$f":"IF(E3=\"NO\",C3,\"DELETE\")","v":"DELETE"},{"$f":"IF(E3=\"NO\",D3,\"DELETE\")","v":"DELETE"}]
[null,{"$f":"IF(E4=\"NO\",B4,\"DELETE\")","v":"DELETE"},{"$f":"IF(E4=\"NO\",C4,\"DELETE\")","v":"DELETE"},{"$f":"IF(E4=\"NO\",D4,\"DELETE\")","v":"DELETE"}]
[null,"DELETE","DELETE","DELETE"]
[null,"DELETE","DELETE","DELETE"]
[null,"DELETE","DELETE","DELETE"]
[null,"DELETE","DELETE","DELETE"]
[null,"DELETE","DELETE","DELETE"]
[null,"DELETE","DELETE","DELETE"]
[null,"DELETE","DELETE","DELETE"]
[null,"DELETE","DELETE","DELETE"]
[null,"DELETE","DELETE","DELETE"]
[null,"DELETE","DELETE","DELETE"]
[null,"DELETE","DELETE","DELETE"]
[null,"DELETE","DELETE","DELETE"]
[null,"DELETE","DELETE","DELETE"]
[null,"DELETE","DELETE","DELETE"]
[null,"DELETE","DELETE","DELETE"]
[null,"DELETE","DELETE","DELETE"]
[null,"DELETE","DELETE","DELETE"]
[null,"DELETE","DELETE","DELETE"]
[null,"DELETE","DELETE","DELETE"]
[null,"DELETE","DELETE","DELETE"]
[null,"DELETE","DELETE","DELETE"]
[null,"DELETE","DELETE","DELETE"]
[null,"DELETE","DELETE","DELETE"]
[null,"DELETE","DELETE","DELETE"]
[null,"DELETE","DELETE","DELETE"]
[null,"DELETE","DELETE","DELETE"]
[null,"DELETE","DELETE","DELETE"]
[null,"DELETE","DELETE","DELETE"]
[null,"DELETE","DELETE","DELETE"]
[null,"DELETE","DELETE","DELETE"]
[null,"DELETE","DELETE","DELETE"]
[null,"DELETE","DELETE","DELETE"]
[null,"DELETE","DELETE","DELETE"]
[null,"DELETE","DELETE","DELETE"]
[null,"DELETE","DELETE","DELETE"]
[null,"DELETE","DELETE","DELETE"]
[null,"DELETE","DELETE","DELETE"]
[null,"DELETE","DELETE","DELETE"]
[null,"DELETE","DELETE","DELETE"]
[null,"DELETE","DELETE","DELETE"]
[null,"DELETE","DELETE","DELETE"]
[null,"DELETE","DELETE","DELETE"]
[null,"DELETE","DELETE","DELETE"]
[null,"DELETE","DELETE","DELETE"]
[null,"DELETE","DELETE","DELETE"]
[null,"DELETE","DELETE","DELETE"]
[null,"DELETE","DELETE","DELETE"]
[null,"DELETE","DELETE","DELETE"]
[null,"DELETE","DELETE","DELETE"]
[null,"DELETE","DELETE","DELETE"]
[null,"DELETE","DELETE","DELETE"]
[null,"DELETE","DELETE","DELETE"]
[null,"DELETE","DELETE","DELETE"]
[null,"DELETE","DELETE","DELETE"]
[null,"DELETE","DELETE","DELETE"]
[null,"DELETE","DELETE","DELETE"]
[null,"DELETE","DELETE","DELETE"]
[null,"DELETE","DELETE","DELETE"]
[null,"DELETE","DELETE","DELETE"]
[null,"DELETE","DELETE","DELETE"]
[null,"DELETE","DELETE","DELETE"]
[null,"DELETE","DELETE","DELETE"]
[null,"DELETE","DELETE","DELETE"]
[null,{"$f":"IF(E68=\"NO\",B68,\"DELETE\")","v":"DELETE"},{"$f":"IF(E68=\"NO\",C68,\"DELETE\")","v":"DELETE"},{"$f":"IF(E68=\"NO\",D68,\"DELETE\")","v":"DELETE"}]
[null,"DELETE","DELETE","DELETE"]
[null,"DELETE","DELETE","DELETE"]
[null,"DELETE","DELETE","DELETE"]
[null,"DELETE","DELETE","DELETE"]
[null,"DELETE","DELETE","DELETE"]
[null,"DELETE","DELETE","DELETE"]
[null,"DELETE","DELETE","DELETE"]
[null,"DELETE","DELETE","DELETE"]
[null,"DELETE","DELETE","DELETE"]
[null,"DELETE","DELETE","DELETE"]
[null,"DELETE","DELETE","DELETE"]
[null,"DELETE","DELETE","DELETE"]
[null,"DELETE","DELETE","DELETE"]
[null,"DELETE","DELETE","DELETE"]
[null,"DELETE","DELETE","DELETE"]
[null,"DELETE","DELETE","DELETE"]
[null,"DELETE","DELETE","DELETE"]
[null,"DELETE","DELETE","DELETE"]
[null,"DELETE","DELETE","DELETE"]
[null,"DELETE","DELETE","DELETE"]
[null,"DELETE","DELETE","DELETE"]
[null,"DELETE","DELETE","DELETE"]
[null,"DELETE","DELETE","DELETE"]
[null,"DELETE","DELETE","DELETE"]
[null,"DELETE","DELETE","DELETE"]
[null,"DELETE","DELETE","DELETE"]
[null,"DELETE","DELETE","DELETE"]
[null,"DELETE","DELETE","DELETE"]
[null,"DELETE","DELETE","DELETE"]
[null,"DELETE","DELETE","DELETE"]
[null,"DELETE","DELETE","DELETE"]
[null,"DELETE","DELETE","DELETE"]
[null,"DELETE","DELETE","DELETE"]
[null,"DELETE","DELETE","DELETE"]
[null,"DELETE","DELETE","DELETE"]
[null,"DELETE","DELETE","DELETE"]
[null,"DELETE","DELETE","DELETE"]
[null,"DELETE","DELETE","DELETE"]
[null,"DELETE","DELETE","DELETE"]
[null,"DELETE","DELETE","DELETE"]
[null,"DELETE","DELETE","DELETE"]
[null,"DELETE","DELETE","DELETE"]
[null,"DELETE","DELETE","DELETE"]
[null,"DELETE","DELETE","DELETE"]
[null,"DELETE","DELETE","DELETE"]
[null,"DELETE","DELETE","DELETE"]
[null,"DELETE","DELETE","DELETE"]
[null,"DELETE","DELETE","DELETE"]
[null,"DELETE","DELETE","DELETE"]
[null,"DELETE","DELETE","DELETE"]
[null,"DELETE","DELETE","DELETE"]
[null,"DELETE","DELETE","DELETE"]
[null,"DELETE","DELETE","DELETE"]
[null,"DELETE","DELETE","DELETE"]
[null,"DELETE","DELETE","DELETE"]
[null,"DELETE","DELETE","DELETE"]
[null,"DELETE","DELETE","DELETE"]
[null,"DELETE","DELETE","DELETE"]
[null,"DELETE","DELETE","DELETE"]
[null,"DELETE","DELETE","DELETE"]
[null,"DELETE","DELETE","DELETE"]
[null,"DELETE","DELETE","DELETE"]
[null,"DELETE","DELETE","DELETE"]
[null,{"$f":"IF(E132=\"NO\",B132,\"DELETE\")","v":"DELETE"},{"$f":"IF(E132=\"NO\",C132,\"DELETE\")","v":"DELETE"},{"$f":"IF(E132=\"NO\",D132,\"DELETE\")","v":"DELETE"}]
[null,"DELETE","DELETE","DELETE"]
[null,"DELETE","DELETE","DELETE"]
[null,"DELETE","DELETE","DELETE"]
[null,"DELETE","DELETE","DELETE"]
[null,"DELETE","DELETE","DELETE"]
[null,"DELETE","DELETE","DELETE"]
[null,"DELETE","DELETE","DELETE"]
[null,"DELETE","DELETE","DELETE"]
[null,"DELETE","DELETE","DELETE"]
[null,"DELETE","DELETE","DELETE"]
[null,"DELETE","DELETE","DELETE"]
[null,"DELETE","DELETE","DELETE"]
[null,"DELETE","DELETE","DELETE"]
[null,"DELETE","DELETE","DELETE"]
[null,"DELETE","DELETE","DELETE"]
[null,"DELETE","DELETE","DELETE"]
[null,"DELETE","DELETE","DELETE"]
[null,"DELETE","DELETE","DELETE"]
[null,"DELETE","DELETE","DELETE"]
[null,"DELETE","DELETE","DELETE"]
[null,"DELETE","DELETE","DELETE"]
[null,"DELETE","DELETE","DELETE"]
[null,"DELETE","DELETE","DELETE"]
[null,"DELETE","DELETE","DELETE"]
[null,"DELETE","DELETE","DELETE"]
[null,"DELETE","DELETE","DELETE"]
[null,"DELETE","DELETE","DELETE"]
[null,"DELETE","DELETE","DELETE"]
[null,"DELETE","DELETE","DELETE"]
[null,"DELETE","DELETE","DELETE"]
[null,"DELETE","DELETE","DELETE"]
[null,"DELETE","DELETE","DELETE"]
[null,"DELETE","DELETE","DELETE"]
[null,"DELETE","DELETE","DELETE"]
[null,"DELETE","DELETE","DELETE"]
[null,"DELETE","DELETE","DELETE"]
[null,"DELETE","DELETE","DELETE"]
[null,"DELETE","DELETE","DELETE"]
[null,"DELETE","DELETE","DELETE"]
[null,"DELETE","DELETE","DELETE"]
[null,"DELETE","DELETE","DELETE"]
[null,"DELETE","DELETE","DELETE"]
[null,"DELETE","DELETE","DELETE"]
[null,"DELETE","DELETE","DELETE"]
[null,"DELETE","DELETE","DELETE"]
[null,{"$f":"IF(E178=\"NO\",B178,\"DELETE\")","v":"DELETE"},{"$f":"IF(E178=\"NO\",C178,\"DELETE\")","v":"DELETE"},{"$f":"IF(E178=\"NO\",D178,\"DELETE\")","v":"DELETE"}]
[null,"DELETE","DELETE","DELETE"]
[null,"DELETE","DELETE","DELETE"]
[null,"DELETE","DELETE","DELETE"]
[null,"DELETE","DELETE","DELETE"]

{"sheet":"Sheet2","index":1,"n_rows":0,"n_cols":0,"rows_kept":0,"cut":false,"hidden":false,"merged":[]}

{"sheet":"Sheet3","index":2,"n_rows":0,"n_cols":0,"rows_kept":0,"cut":false,"hidden":false,"merged":[]}