{"text_format":"1","workbook":"xlsx","n_sheets":3,"sheets":["Sheet1","Sheet2","Sheet3"],"not_rendered":{"charts":0,"images":0,"macros":1,"external_links":0,"defined_names":0,"comments":0,"pivot_tables":0},"unopened":[],"bounds":{"document_bytes":16777216,"sheet_cells":100000,"rows_first":2000,"rows_last":500,"rows_between":2000,"halvings":0,"cell_chars":16384,"cell_head_chars":4096},"cells_cut":0,"cells_raw":0,"read":"whole","date_system":"1900"}

{"sheet":"Sheet1","index":0,"n_rows":711,"n_cols":16,"rows_kept":711,"cut":false,"hidden":false,"merged":[[364,3,364,8],[360,3,360,8],[361,3,361,8],[362,3,362,8],[363,3,363,8],[381,3,381,8],[382,3,382,8],[383,3,383,8],[384,3,384,8],[365,3,365,8],[366,3,366,8],[367,3,367,8],[368,3,368,8],[369,3,369,8],[375,3,375,8],[376,3,376,8],[377,3,377,8],[378,3,378,8],[379,3,379,8],[380,3,380,8],[370,3,370,8],[371,3,371,8],[372,3,372,8],[373,3,373,8],[374,3,374,8],[392,3,392,8],[389,3,389,8],[390,3,390,8],[391,3,391,8],[385,3,385,8],[386,3,386,8],[387,3,387,8],[388,3,388,8],[393,3,393,8],[394,3,394,8],[395,3,395,8],[396,3,396,8],[397,3,397,8],[398,3,398,8],[399,3,399,8],[400,3,400,8],[401,3,401,8],[402,3,402,8],[403,3,403,8],[404,3,404,8],[405,3,405,8],[406,3,406,8],[407,3,407,8],[408,3,408,8],[409,3,409,8],[410,3,410,8],[411,3,411,8],[412,3,412,8],[413,3,413,8],[414,3,414,8],[415,3,415,8],[416,3,416,8],[417,3,417,8],[418,3,418,8],[419,3,419,8],[420,3,420,8],[421,3,421,8],[422,3,422,8],[423,3,423,8],[424,3,424,8],[425,3,425,8],[426,3,426,8],[540,3,540,8],[539,3,539,8],[538,3,538,8],[537,3,537,8],[536,3,536,8],[535,3,535,8],[534,3,534,8],[533,3,533,8],[532,3,532,8],[531,3,531,8],[530,3,530,8],[529,3,529,8],[528,3,528,8],[527,3,527,8],[526,3,526,8],[525,3,525,8],[524,3,524,8],[523,3,523,8],[522,3,522,8],[521,3,521,8],[520,3,520,8],[519,3,519,8],[518,3,518,8],[517,3,517,8],[516,3,516,8],[515,3,515,8],[514,3,514,8],[513,3,513,8],[512,3,512,8],[511,3,511,8],[510,3,510,8],[509,3,509,8],[508,3,508,8],[507,3,507,8],[506,3,506,8],[505,3,505,8],[504,3,504,8],[503,3,503,8],[502,3,502,8],[501,3,501,8],[500,3,500,8],[499,3,499,8],[498,3,498,8],[497,3,497,8],[496,3,496,8],[495,3,495,8],[494,3,494,8],[493,3,493,8],[492,3,492,8],[491,3,491,8],[490,3,490,8],[489,3,489,8],[488,3,488,8],[487,3,487,8],[486,3,486,8],[485,3,485,8],[484,3,484,8],[483,3,483,8],[482,3,482,8],[481,3,481,8],[480,3,480,8],[479,3,479,8],[478,3,478,8],[477,3,477,8],[476,3,476,8],[475,3,475,8],[474,3,474,8],[473,3,473,8],[472,3,472,8],[471,3,471,8],[470,3,470,8],[469,3,469,8],[468,3,468,8],[467,3,467,8],[466,3,466,8],[465,3,465,8],[464,3,464,8],[463,3,463,8],[462,3,462,8],[461,3,461,8],[460,3,460,8],[459,3,459,8],[458,3,458,8],[457,3,457,8],[456,3,456,8],[455,3,455,8],[454,3,454,8],[453,3,453,8],[452,3,452,8],[451,3,451,8],[450,3,450,8],[449,3,449,8],[448,3,448,8],[447,3,447,8],[446,3,446,8],[445,3,445,8],[444,3,444,8],[434,3,434,8],[433,3,433,8],[432,3,432,8],[431,3,431,8],[430,3,430,8],[429,3,429,8],[428,3,428,8],[427,3,427,8],[443,3,443,8],[442,3,442,8],[441,3,441,8],[440,3,440,8],[439,3,439,8],[438,3,438,8],[437,3,437,8],[436,3,436,8],[435,3,435,8],[541,3,541,8],[542,3,542,8],[543,3,543,8],[544,3,544,8],[545,3,545,8],[546,3,546,8],[547,3,547,8],[548,3,548,8],[549,3,549,8],[550,3,550,8],[551,3,551,8],[552,3,552,8],[553,3,553,8],[554,3,554,8],[555,3,555,8],[556,3,556,8],[557,3,557,8],[558,3,558,8],[559,3,559,8],[560,3,560,8],[561,3,561,8],[562,3,562,8],[563,3,563,8],[564,3,564,8],[565,3,565,8],[566,3,566,8],[567,3,567,8],[568,3,568,8],[569,3,569,8],[570,3,570,8],[571,3,571,8],[572,3,572,8],[573,3,573,8],[574,3,574,8],[575,3,575,8],[576,3,576,8],[577,3,577,8],[578,3,578,8],[579,3,579,8],[580,3,580,8],[581,3,581,8],[582,3,582,8],[583,3,583,8],[584,3,584,8],[585,3,585,8],[586,3,586,8],[587,3,587,8],[588,3,588,8],[589,3,589,8],[590,3,590,8],[591,3,591,8],[592,3,592,8],[593,3,593,8],[594,3,594,8],[595,3,595,8],[596,3,596,8],[597,3,597,8],[598,3,598,8],[599,3,599,8],[600,3,600,8],[601,3,601,8],[602,3,602,8],[603,3,603,8],[604,3,604,8],[605,3,605,8],[606,3,606,8],[607,3,607,8],[608,3,608,8],[609,3,609,8],[610,3,610,8],[611,3,611,8],[612,3,612,8],[613,3,613,8],[614,3,614,8],[615,3,615,8],[616,3,616,8],[617,3,617,8],[618,3,618,8],[619,3,619,8],[620,3,620,8],[621,3,621,8],[622,3,622,8],[623,3,623,8],[624,3,624,8],[625,3,625,8],[626,3,626,8],[627,3,627,8],[628,3,628,8],[629,3,629,8],[630,3,630,8],[631,3,631,8],[632,3,632,8],[633,3,633,8],[634,3,634,8],[635,3,635,8],[636,3,636,8],[637,3,637,8],[638,3,638,8],[639,3,639,8],[640,3,640,8],[641,3,641,8],[642,3,642,8],[643,3,643,8],[644,3,644,8],[645,3,645,8],[646,3,646,8],[647,3,647,8],[648,3,648,8],[658,3,658,8],[659,3,659,8],[660,3,660,8],[649,3,649,8],[650,3,650,8],[651,3,651,8],[652,3,652,8],[653,3,653,8],[654,3,654,8],[655,3,655,8],[656,3,656,8],[657,3,657,8],[661,3,661,8],[662,3,662,8],[663,3,663,8],[664,3,664,8],[665,3,665,8],[666,3,666,8],[667,3,667,8],[668,3,668,8],[669,3,669,8],[670,3,670,8],[671,3,671,8],[672,3,672,8],[673,3,673,8],[674,3,674,8],[675,3,675,8],[676,3,676,8],[677,3,677,8],[678,3,678,8],[679,3,679,8],[680,3,680,8],[681,3,681,8],[682,3,682,8],[683,3,683,8],[684,3,684,8],[685,3,685,8],[686,3,686,8],[687,3,687,8],[688,3,688,8],[689,3,689,8],[690,3,690,8],[691,3,691,8],[692,3,692,8],[693,3,693,8],[694,3,694,8],[695,3,695,8],[696,3,696,8],[706,3,706,8],[707,3,707,8],[708,3,708,8],[709,3,709,8],[710,3,710,8],[697,3,697,8],[698,3,698,8],[699,3,699,8],[700,3,700,8],[701,3,701,8],[702,3,702,8],[703,3,703,8],[704,3,704,8],[705,3,705,8]]}
[null,"One-Test Measure"]
[null,"Last Name","First Name","Assessment Score","Assessment Percentage","Target Met?","Score Counted for Data",null,null,null,"Counted? Counter","Target Met? Counter","Target Did Not Meet? Counter","Counted and Met? Counter","Counted and Did Not Meet? Counter","Assessment Score Validation"]
[1,null,null,null,{"$f":"(D3/$I$4)","v":{"$error":"#DIV/0!"}},{"$f":"IF(E3>=$I$11,\"YES\", IF(AND(E3<$I$11,E3>=1%),\"NO\",IF(AND(E3=0%),\"INVALID\")))","v":{"$error":"#DIV/0!"}},"YES","Teacher",", ","YES",{"$f":"COUNTIF(G3,\"yes\")","v":1},{"$f":"COUNTIF(F3,\"yes\")","v":0},{"$f":"COUNTIF(F3,\"no\")","v":0},{"$f":"K3+L3","v":1},{"$f":"K3+M3","v":1},{"$f":"IF(D3>$I$4,InvalidAssessmentScore())","v":false}]
[2,null,null,null,{"$error":"#DIV/0!"},{"$error":"#DIV/0!"},"YES","Assessment Points Possible",null,"NO",{"$f":"COUNTIF(G4,\"yes\")","v":1},{"$f":"COUNTIF(F4,\"yes\")","v":0},{"$f":"COUNTIF(F4,\"no\")","v":0},{"$f":"K4+L4","v":1},{"$f":"K4+M4","v":1},{"$f":"IF(D4>$I$4,InvalidAssessmentScore())","v":false}]
[3,null,null,null,{"$error":"#DIV/0!"},{"$error":"#DIV/0!"},"YES","Total Tested",{"$f":"COUNTA(B3:B352)","v":0},null,1,0,0,1,1,{"$f":"IF(D5>$I$4,InvalidAssessmentScore())","v":false}]
[4,null,null,null,{"$error":"#DIV/0!"},{"$error":"#DIV/0!"},"YES","Total Excluded",{"$f":"COUNTIF(G:G,\"NO\")","v":0},null,1,0,0,1,1,{"$f":"IF(D6>$I$4,InvalidAssessmentScore())","v":false}]
[5,null,null,null,{"$error":"#DIV/0!"},{"$error":"#DIV/0!"},"YES","Total Counted",{"$f":"I5-I6","v":0},null,1,0,0,1,1,{"$f":"IF(D7>$I$4,InvalidAssessmentScore())","v":false}]
[6,null,null,null,{"$error":"#DIV/0!"},{"$error":"#DIV/0!"},"YES","Target Met (Counted)",{"$f":"COUNTIF(N:N,\"2\")","v":0},null,1,0,0,1,1,{"$f":"IF(D8>$I$4,InvalidAssessmentScore())","v":false}]
[7,null,null,null,{"$error":"#DIV/0!"},{"$error":"#DIV/0!"},"YES","Target Did Not Meet (Counted)",{"$f":"COUNTIF(O:O,\"2\")","v":0},null,1,0,0,1,1,{"$f":"IF(D9>$I$4,InvalidAssessmentScore())","v":false}]
[8,null,null,null,{"$error":"#DIV/0!"},{"$error":"#DIV/0!"},"YES","Percentage Meeting Target",{"$f":"I8/I7","v":{"$error":"#DIV/0!"}},null,1,0,0,1,1,{"$f":"IF(D10>$I$4,InvalidAssessmentScore())","v":false}]
[9,null,null,null,{"$error":"#DIV/0!"},{"$error":"#DIV/0!"},"YES","Proficiency Threshold (%)",0,null,1,0,0,1,1,{"$f":"IF(D11>$I$4,InvalidAssessmentScore())","v":false}]
[10,null,null,null,{"$error":"#DIV/0!"},{"$error":"#DIV/0!"},"YES",null,null,null,1,0,0,1,1,{"$f":"IF(D12>$I$4,InvalidAssessmentScore())","v":false}]
[11,null,null,null,{"$error":"#DIV/0!"},{"$error":"#DIV/0!"},"YES",null,null,null,1,0,0,1,1,{"$f":"IF(D13>$I$4,InvalidAssessmentScore())","v":false}]
[12,null,null,null,{"$error":"#DIV/0!"},{"$error":"#DIV/0!"},"YES",null,null,null,1,0,0,1,1,{"$f":"IF(D14>$I$4,InvalidAssessmentScore())","v":false}]
[13,null,null,null,{"$error":"#DIV/0!"},{"$error":"#DIV/0!"},"YES",null,null,null,1,0,0,1,1,{"$f":"IF(D15>$I$4,InvalidAssessmentScore())","v":false}]
[14,null,null,null,{"$error":"#DIV/0!"},{"$error":"#DIV/0!"},"YES",null,null,null,1,0,0,1,1,{"$f":"IF(D16>$I$4,InvalidAssessmentScore())","v":false}]
[15,null,null,null,{"$error":"#DIV/0!"},{"$error":"#DIV/0!"},"YES",null,null,null,1,0,0,1,1,{"$f":"IF(D17>$I$4,InvalidAssessmentScore())","v":false}]
[16,null,null,null,{"$error":"#DIV/0!"},{"$error":"#DIV/0!"},"YES",null,null,null,1,0,0,1,1,{"$f":"IF(D18>$I$4,InvalidAssessmentScore())","v":false}]
[17,null,null,null,{"$error":"#DIV/0!"},{"$error":"#DIV/0!"},"YES",null,null,null,1,0,0,1,1,{"$f":"IF(D19>$I$4,InvalidAssessmentScore())","v":false}]
[18,null,null,null,{"$error":"#DIV/0!"},{"$error":"#DIV/0!"},"YES",null,null,null,1,0,0,1,1,{"$f":"IF(D20>$I$4,InvalidAssessmentScore())","v":false}]
[19,null,null,null,{"$error":"#DIV/0!"},{"$error":"#DIV/0!"},"YES",null,null,null,1,0,0,1,1,{"$f":"IF(D21>$I$4,InvalidAssessmentScore())","v":false}]
[20,null,null,null,{"$error":"#DIV/0!"},{"$error":"#DIV/0!"},"YES",null,null,null,1,0,0,1,1,{"$f":"IF(D22>$I$4,InvalidAssessmentScore())","v":false}]
[21,null,null,null,{"$error":"#DIV/0!"},{"$error":"#DIV/0!"},"YES",null,null,null,1,0,0,1,1,{"$f":"IF(D23>$I$4,InvalidAssessmentScore())","v":false}]
[22,null,null,null,{"$error":"#DIV/0!"},{"$error":"#DIV/0!"},"YES",null,null,null,1,0,0,1,1,{"$f":"IF(D24>$I$4,InvalidAssessmentScore())","v":false}]
[23,null,null,null,{"$error":"#DIV/0!"},{"$error":"#DIV/0!"},"YES",null,null,null,1,0,0,1,1,{"$f":"IF(D25>$I$4,InvalidAssessmentScore())","v":false}]
[24,null,null,null,{"$error":"#DIV/0!"},{"$error":"#DIV/0!"},"YES",null,null,null,1,0,0,1,1,{"$f":"IF(D26>$I$4,InvalidAssessmentScore())","v":false}]
[25,null,null,null,{"$error":"#DIV/0!"},{"$error":"#DIV/0!"},"YES",null,null,null,1,0,0,1,1,{"$f":"IF(D27>$I$4,InvalidAssessmentScore())","v":false}]
[26,null,null,null,{"$error":"#DIV/0!"},{"$error":"#DIV/0!"},"YES",null,null,null,1,0,0,1,1,{"$f":"IF(D28>$I$4,InvalidAssessmentScore())","v":false}]
[27,null,null,null,{"$error":"#DIV/0!"},{"$error":"#DIV/0!"},"YES",null,null,null,1,0,0,1,1,{"$f":"IF(D29>$I$4,InvalidAssessmentScore())","v":false}]
[28,null,null,null,{"$error":"#DIV/0!"},{"$error":"#DIV/0!"},"YES",null,null,null,1,0,0,1,1,{"$f":"IF(D30>$I$4,InvalidAssessmentScore())","v":false}]
[29,null,null,null,{"$error":"#DIV/0!"},{"$error":"#DIV/0!"},"YES",null,null,null,1,0,0,1,1,{"$f":"IF(D31>$I$4,InvalidAssessmentScore())","v":false}]
[30,null,null,null,{"$error":"#DIV/0!"},{"$error":"#DIV/0!"},"YES",null,null,null,1,0,0,1,1,{"$f":"IF(D32>$I$4,InvalidAssessmentScore())","v":false}]
[31,null,null,null,{"$error":"#DIV/0!"},{"$error":"#DIV/0!"},"YES",null,null,null,1,0,0,1,1,{"$f":"IF(D33>$I$4,InvalidAssessmentScore())","v":false}]
[32,null,null,null,{"$error":"#DIV/0!"},{"$error":"#DIV/0!"},"YES",null,null,null,1,0,0,1,1,{"$f":"IF(D34>$I$4,InvalidAssessmentScore())","v":false}]
[33,null,null,null,{"$f":"(D35/$I$4)","v":{"$error":"#DIV/0!"}},{"$f":"IF(E35>=$I$11,\"YES\", IF(AND(E35<$I$11,E35>=1%),\"NO\",IF(AND(E35=0%),\"INVALID\")))","v":{"$error":"#DIV/0!"}},"YES",null,null,null,1,0,0,1,1,{"$f":"IF(D35>$I$4,InvalidAssessmentScore())","v":false}]
[34,null,null,null,{"$error":"#DIV/0!"},{"$error":"#DIV/0!"},"YES",null,null,null,1,0,0,1,1,{"$f":"IF(D36>$I$4,InvalidAssessmentScore())","v":false}]
[35,null,null,null,{"$error":"#DIV/0!"},{"$error":"#DIV/0!"},"YES",null,null,null,1,0,0,1,1,{"$f":"IF(D37>$I$4,InvalidAssessmentScore())","v":false}]
[36,null,null,null,{"$error":"#DIV/0!"},{"$error":"#DIV/0!"},"YES",null,null,null,1,0,0,1,1,{"$f":"IF(D38>$I$4,InvalidAssessmentScore())","v":false}]
[37,null,null,null,{"$error":"#DIV/0!"},{"$error":"#DIV/0!"},"YES",null,null,null,1,0,0,1,1,{"$f":"IF(D39>$I$4,InvalidAssessmentScore())","v":false}]
[38,null,null,null,{"$error":"#DIV/0!"},{"$error":"#DIV/0!"},"YES",null,null,null,1,0,0,1,1,{"$f":"IF(D40>$I$4,InvalidAssessmentScore())","v":false}]
[39,null,null,null,{"$error":"#DIV/0!"},{"$error":"#DIV/0!"},"YES",null,null,null,1,0,0,1,1,{"$f":"IF(D41>$I$4,InvalidAssessmentScore())","v":false}]
[40,null,null,null,{"$error":"#DIV/0!"},{"$error":"#DIV/0!"},"YES",null,null,null,1,0,0,1,1,{"$f":"IF(D42>$I$4,InvalidAssessmentScore())","v":false}]
[41,null,null,null,{"$error":"#DIV/0!"},{"$error":"#DIV/0!"},"YES",null,null,null,1,0,0,1,1,{"$f":"IF(D43>$I$4,InvalidAssessmentScore())","v":false}]
[42,null,null,null,{"$error":"#DIV/0!"},{"$error":"#DIV/0!"},"YES",null,null,null,1,0,0,1,1,{"$f":"IF(D44>$I$4,InvalidAssessmentScore())","v":false}]
[43,null,null,null,{"$error":"#DIV/0!"},{"$error":"#DIV/0!"},"YES",null,null,null,1,0,0,1,1,{"$f":"IF(D45>$I$4,InvalidAssessmentScore())","v":false}]
[44,null,null,null,{"$error":"#DIV/0!"},{"$error":"#DIV/0!"},"YES",null,null,null,1,0,0,1,1,{"$f":"IF(D46>$I$4,InvalidAssessmentScore())","v":false}]
[45,null,null,null,{"$error":"#DIV/0!"},{"$error":"#DIV/0!"},"YES",null,null,null,1,0,0,1,1,{"$f":"IF(D47>$I$4,InvalidAssessmentScore())","v":false}]
[46,null,null,null,{"$error":"#DIV/0!"},{"$error":"#DIV/0!"},"YES",null,null,null,1,0,0,1,1,{"$f":"IF(D48>$I$4,InvalidAssessmentScore())","v":false}]
[47,null,null,null,{"$error":"#DIV/0!"},{"$error":"#DIV/0!"},"YES",null,null,null,1,0,0,1,1,{"$f":"IF(D49>$I$4,InvalidAssessmentScore())","v":false}]
[48,null,null,null,{"$error":"#DIV/0!"},{"$error":"#DIV/0!"},"YES",null,null,null,1,0,0,1,1,{"$f":"IF(D50>$I$4,InvalidAssessmentScore())","v":false}]
[49,null,null,null,{"$error":"#DIV/0!"},{"$error":"#DIV/0!"},"YES",null,null,null,1,0,0,1,1,{"$f":"IF(D51>$I$4,InvalidAssessmentScore())","v":false}]
[50,null,null,null,{"$error":"#DIV/0!"},{"$error":"#DIV/0!"},"YES",null,null,null,1,0,0,1,1,{"$f":"IF(D52>$I$4,InvalidAssessmentScore())","v":false}]
[51,null,null,null,{"$error":"#DIV/0!"},{"$error":"#DIV/0!"},"YES",null,null,null,1,0,0,1,1,{"$f":"IF(D53>$I$4,InvalidAssessmentScore())","v":false}]
[52,null,null,null,{"$error":"#DIV/0!"},{"$error":"#DIV/0!"},"YES",null,null,null,1,0,0,1,1,{"$f":"IF(D54>$I$4,InvalidAssessmentScore())","v":false}]
[53,null,null,null,{"$error":"#DIV/0!"},{"$error":"#DIV/0!"},"YES",null,null,null,1,0,0,1,1,{"$f":"IF(D55>$I$4,InvalidAssessmentScore())","v":false}]
[54,null,null,null,{"$error":"#DIV/0!"},{"$error":"#DIV/0!"},"YES",null,null,null,1,0,0,1,1,{"$f":"IF(D56>$I$4,InvalidAssessmentScore())","v":false}]
[55,null,null,null,{"$error":"#DIV/0!"},{"$error":"#DIV/0!"},"YES",null,null,null,1,0,0,1,1,{"$f":"IF(D57>$I$4,InvalidAssessmentScore())","v":false}]
[56,null,null,null,{"$error":"#DIV/0!"},{"$error":"#DIV/0!"},"YES",null,null,null,1,0,0,1,1,{"$f":"IF(D58>$I$4,InvalidAssessmentScore())","v":false}]
[57,null,null,null,{"$error":"#DIV/0!"},{"$error":"#DIV/0!"},"YES",null,null,null,1,0,0,1,1,{"$f":"IF(D59>$I$4,InvalidAssessmentScore())","v":false}]
[58,null,null,null,{"$error":"#DIV/0!"},{"$error":"#DIV/0!"},"YES",null,null,null,1,0,0,1,1,{"$f":"IF(D60>$I$4,InvalidAssessmentScore())","v":false}]
[59,null,null,null,{"$error":"#DIV/0!"},{"$error":"#DIV/0!"},"YES",null,null,null,1,0,0,1,1,{"$f":"IF(D61>$I$4,InvalidAssessmentScore())","v":false}]
[60,null,null,null,{"$error":"#DIV/0!"},{"$error":"#DIV/0!"},"YES",null,null,null,1,0,0,1,1,{"$f":"IF(D62>$I$4,InvalidAssessmentScore())","v":false}]
[61,null,null,null,{"$error":"#DIV/0!"},{"$error":"#DIV/0!"},"YES",null,null,null,1,0,0,1,1,{"$f":"IF(D63>$I$4,InvalidAssessmentScore())","v":false}]
[62,null,null,null,{"$error":"#DIV/0!"},{"$error":"#DIV/0!"},"YES",null,null,null,1,0,0,1,1,{"$f":"IF(D64>$I$4,InvalidAssessmentScore())","v":false}]
[63,null,null,null,{"$error":"#DIV/0!"},{"$error":"#DIV/0!"},"YES",null,null,null,1,0,0,1,1,{"$f":"IF(D65>$I$4,InvalidAssessmentScore())","v":false}]
[64,null,null,null,{"$error":"#DIV/0!"},{"$error":"#DIV/0!"},"YES",null,null,null,1,0,0,1,1,{"$f":"IF(D66>$I$4,InvalidAssessmentScore())","v":false}]
[65,null,null,null,{"$f":"(D67/$I$4)","v":{"$error":"#DIV/0!"}},{"$f":"IF(E67>=$I$11,\"YES\", IF(AND(E67<$I$11,E67>=1%),\"NO\",IF(AND(E67=0%),\"INVALID\")))","v":{"$error":"#DIV/0!"}},"YES",null,null,null,1,0,0,1,1,{"$f":"IF(D67>$I$4,InvalidAssessmentScore())","v":false}]
[66,null,null,null,{"$error":"#DIV/0!"},{"$error":"#DIV/0!"},"YES",null,null,null,{"$f":"COUNTIF(G68,\"yes\")","v":1},{"$f":"COUNTIF(F68,\"yes\")","v":0},{"$f":"COUNTIF(F68,\"no\")","v":0},{"$f":"K68+L68","v":1},{"$f":"K68+M68","v":1},{"$f":"IF(D68>$I$4,InvalidAssessmentScore())","v":false}]
[67,null,null,null,{"$error":"#DIV/0!"},{"$error":"#DIV/0!"},"YES",null,null,null,1,0,0,1,1,{"$f":"IF(D69>$I$4,InvalidAssessmentScore())","v":false}]
[68,null,null,null,{"$error":"#DIV/0!"},{"$error":"#DIV/0!"},"YES",null,null,null,1,0,0,1,1,{"$f":"IF(D70>$I$4,InvalidAssessmentScore())","v":false}]
[69,null,null,null,{"$error":"#DIV/0!"},{"$error":"#DIV/0!"},"YES",null,null,null,1,0,0,1,1,{"$f":"IF(D71>$I$4,InvalidAssessmentScore())","v":false}]
[70,null,null,null,{"$error":"#DIV/0!"},{"$error":"#DIV/0!"},"YES",null,null,null,1,0,0,1,1,{"$f":"IF(D72>$I$4,InvalidAssessmentScore())","v":false}]
[71,null,null,null,{"$error":"#DIV/0!"},{"$error":"#DIV/0!"},"YES",null,null,null,1,0,0,1,1,{"$f":"IF(D73>$I$4,InvalidAssessmentScore())","v":false}]
[72,null,null,null,{"$error":"#DIV/0!"},{"$error":"#DIV/0!"},"YES",null,null,null,1,0,0,1,1,{"$f":"IF(D74>$I$4,InvalidAssessmentScore())","v":false}]
[73,null,null,null,{"$error":"#DIV/0!"},{"$error":"#DIV/0!"},"YES",null,null,null,1,0,0,1,1,{"$f":"IF(D75>$I$4,InvalidAssessmentScore())","v":false}]
[74,null,null,null,{"$error":"#DIV/0!"},{"$error":"#DIV/0!"},"YES",null,null,null,1,0,0,1,1,{"$f":"IF(D76>$I$4,InvalidAssessmentScore())","v":false}]
[75,null,null,null,{"$error":"#DIV/0!"},{"$error":"#DIV/0!"},"YES",null,null,null,1,0,0,1,1,{"$f":"IF(D77>$I$4,InvalidAssessmentScore())","v":false}]
[76,null,null,null,{"$error":"#DIV/0!"},{"$error":"#DIV/0!"},"YES",null,null,null,1,0,0,1,1,{"$f":"IF(D78>$I$4,InvalidAssessmentScore())","v":false}]
[77,null,null,null,{"$error":"#DIV/0!"},{"$error":"#DIV/0!"},"YES",null,null,null,1,0,0,1,1,{"$f":"IF(D79>$I$4,InvalidAssessmentScore())","v":false}]
[78,null,null,null,{"$error":"#DIV/0!"},{"$error":"#DIV/0!"},"YES",null,null,null,1,0,0,1,1,{"$f":"IF(D80>$I$4,InvalidAssessmentScore())","v":false}]
[79,null,null,null,{"$error":"#DIV/0!"},{"$error":"#DIV/0!"},"YES",null,null,null,1,0,0,1,1,{"$f":"IF(D81>$I$4,InvalidAssessmentScore())","v":false}]
[80,null,null,null,{"$error":"#DIV/0!"},{"$error":"#DIV/0!"},"YES",null,null,null,1,0,0,1,1,{"$f":"IF(D82>$I$4,InvalidAssessmentScore())","v":false}]
[81,null,null,null,{"$error":"#DIV/0!"},{"$error":"#DIV/0!"},"YES",null,null,null,1,0,0,1,1,{"$f":"IF(D83>$I$4,InvalidAssessmentScore())","v":false}]
[82,null,null,null,{"$error":"#DIV/0!"},{"$error":"#DIV/0!"},"YES",null,null,null,1,0,0,1,1,{"$f":"IF(D84>$I$4,InvalidAssessmentScore())","v":false}]
[83,null,null,null,{"$error":"#DIV/0!"},{"$error":"#DIV/0!"},"YES",null,null,null,1,0,0,1,1,{"$f":"IF(D85>$I$4,InvalidAssessmentScore())","v":false}]
[84,null,null,null,{"$error":"#DIV/0!"},{"$error":"#DIV/0!"},"YES",null,null,null,1,0,0,1,1,{"$f":"IF(D86>$I$4,InvalidAssessmentScore())","v":false}]
[85,null,null,null,{"$error":"#DIV/0!"},{"$error":"#DIV/0!"},"YES",null,null,null,1,0,0,1,1,{"$f":"IF(D87>$I$4,InvalidAssessmentScore())","v":false}]
[86,null,null,null,{"$error":"#DIV/0!"},{"$error":"#DIV/0!"},"YES",null,null,null,1,0,0,1,1,{"$f":"IF(D88>$I$4,InvalidAssessmentScore())","v":false}]
[87,null,null,null,{"$error":"#DIV/0!"},{"$error":"#DIV/0!"},"YES",null,null,null,1,0,0,1,1,{"$f":"IF(D89>$I$4,InvalidAssessmentScore())","v":false}]
[88,null,null,null,{"$error":"#DIV/0!"},{"$error":"#DIV/0!"},"YES",null,null,null,1,0,0,1,1,{"$f":"IF(D90>$I$4,InvalidAssessmentScore())","v":false}]
[89,null,null,null,{"$error":"#DIV/0!"},{"$error":"#DIV/0!"},"YES",null,null,null,1,0,0,1,1,{"$f":"IF(D91>$I$4,InvalidAssessmentScore())","v":false}]
[90,null,null,null,{"$error":"#DIV/0!"},{"$error":"#DIV/0!"},"YES",null,null,null,1,0,0,1,1,{"$f":"IF(D92>$I$4,InvalidAssessmentScore())","v":false}]
[91,null,null,null,{"$error":"#DIV/0!"},{"$error":"#DIV/0!"},"YES",null,null,null,1,0,0,1,1,{"$f":"IF(D93>$I$4,InvalidAssessmentScore())","v":false}]
[92,null,null,null,{"$error":"#DIV/0!"},{"$error":"#DIV/0!"},"YES",null,null,null,1,0,0,1,1,{"$f":"IF(D94>$I$4,InvalidAssessmentScore())","v":false}]
[93,null,null,null,{"$error":"#DIV/0!"},{"$error":"#DIV/0!"},"YES",null,null,null,1,0,0,1,1,{"$f":"IF(D95>$I$4,InvalidAssessmentScore())","v":false}]
[94,null,null,null,{"$error":"#DIV/0!"},{"$error":"#DIV/0!"},"YES",null,null,null,1,0,0,1,1,{"$f":"IF(D96>$I$4,InvalidAssessmentScore())","v":false}]
[95,null,null,null,{"$error":"#DIV/0!"},{"$error":"#DIV/0!"},"YES",null,null,null,1,0,0,1,1,{"$f":"IF(D97>$I$4,InvalidAssessmentScore())","v":false}]
[96,null,null,null,{"$error":"#DIV/0!"},{"$error":"#DIV/0!"},"YES",null,null,null,1,0,0,1,1,{"$f":"IF(D98>$I$4,InvalidAssessmentScore())","v":false}]
[97,null,null,null,{"$f":"(D99/$I$4)","v":{"$error":"#DIV/0!"}},{"$f":"IF(E99>=$I$11,\"YES\", IF(AND(E99<$I$11,E99>=1%),\"NO\",IF(AND(E99=0%),\"INVALID\")))","v":{"$error":"#DIV/0!"}},"YES",null,null,null,1,0,0,1,1,{"$f":"IF(D99>$I$4,InvalidAssessmentScore())","v":false}]
[98,null,null,null,{"$error":"#DIV/0!"},{"$error":"#DIV/0!"},"YES",null,null,null,1,0,0,1,1,{"$f":"IF(D100>$I$4,InvalidAssessmentScore())","v":false}]
[99,null,null,null,{"$error":"#DIV/0!"},{"$error":"#DIV/0!"},"YES",null,null,null,1,0,0,1,1,{"$f":"IF(D101>$I$4,InvalidAssessmentScore())","v":false}]
[100,null,null,null,{"$error":"#DIV/0!"},{"$error":"#DIV/0!"},"YES",null,null,null,1,0,0,1,1,{"$f":"IF(D102>$I$4,InvalidAssessmentScore())","v":false}]
[101,null,null,null,{"$error":"#DIV/0!"},{"$error":"#DIV/0!"},"YES",null,null,null,1,0,0,1,1,{"$f":"IF(D103>$I$4,InvalidAssessmentScore())","v":false}]
[102,null,null,null,{"$error":"#DIV/0!"},{"$error":"#DIV/0!"},"YES",null,null,null,1,0,0,1,1,{"$f":"IF(D104>$I$4,InvalidAssessmentScore())","v":false}]
[103,null,null,null,{"$error":"#DIV/0!"},{"$error":"#DIV/0!"},"YES",null,null,null,1,0,0,1,1,{"$f":"IF(D105>$I$4,InvalidAssessmentScore())","v":false}]
[104,null,null,null,{"$error":"#DIV/0!"},{"$error":"#DIV/0!"},"YES",null,null,null,1,0,0,1,1,{"$f":"IF(D106>$I$4,InvalidAssessmentScore())","v":false}]
[105,null,null,null,{"$error":"#DIV/0!"},{"$error":"#DIV/0!"},"YES",null,null,null,1,0,0,1,1,{"$f":"IF(D107>$I$4,InvalidAssessmentScore())","v":false}]
[106,null,null,null,{"$error":"#DIV/0!"},{"$error":"#DIV/0!"},"YES",null,null,null,1,0,0,1,1,{"$f":"IF(D108>$I$4,InvalidAssessmentScore())","v":false}]
[107,null,null,null,{"$error":"#DIV/0!"},{"$error":"#DIV/0!"},"YES",null,null,null,1,0,0,1,1,{"$f":"IF(D109>$I$4,InvalidAssessmentScore())","v":false}]
[108,null,null,null,{"$error":"#DIV/0!"},{"$error":"#DIV/0!"},"YES",null,null,null,1,0,0,1,1,{"$f":"IF(D110>$I$4,InvalidAssessmentScore())","v":false}]
[109,null,null,null,{"$error":"#DIV/0!"},{"$error":"#DIV/0!"},"YES",null,null,null,1,0,0,1,1,{"$f":"IF(D111>$I$4,InvalidAssessmentScore())","v":false}]
[110,null,null,null,{"$error":"#DIV/0!"},{"$error":"#DIV/0!"},"YES",null,null,null,1,0,0,1,1,{"$f":"IF(D112>$I$4,InvalidAssessmentScore())","v":false}]
[111,null,null,null,{"$error":"#DIV/0!"},{"$error":"#DIV/0!"},"YES",null,null,null,1,0,0,1,1,{"$f":"IF(D113>$I$4,InvalidAssessmentScore())","v":false}]
[112,null,null,null,{"$error":"#DIV/0!"},{"$error":"#DIV/0!"},"YES",null,null,null,1,0,0,1,1,{"$f":"IF(D114>$I$4,InvalidAssessmentScore())","v":false}]
[113,null,null,null,{"$error":"#DIV/0!"},{"$error":"#DIV/0!"},"YES",null,null,null,1,0,0,1,1,{"$f":"IF(D115>$I$4,InvalidAssessmentScore())","v":false}]
[114,null,null,null,{"$error":"#DIV/0!"},{"$error":"#DIV/0!"},"YES",null,null,null,1,0,0,1,1,{"$f":"IF(D116>$I$4,InvalidAssessmentScore())","v":false}]
[115,null,null,null,{"$error":"#DIV/0!"},{"$error":"#DIV/0!"},"YES",null,null,null,1,0,0,1,1,{"$f":"IF(D117>$I$4,InvalidAssessmentScore())","v":false}]
[116,null,null,null,{"$error":"#DIV/0!"},{"$error":"#DIV/0!"},"YES",null,null,null,1,0,0,1,1,{"$f":"IF(D118>$I$4,InvalidAssessmentScore())","v":false}]
[117,null,null,null,{"$error":"#DIV/0!"},{"$error":"#DIV/0!"},"YES",null,null,null,1,0,0,1,1,{"$f":"IF(D119>$I$4,InvalidAssessmentScore())","v":false}]
[118,null,null,null,{"$error":"#DIV/0!"},{"$error":"#DIV/0!"},"YES",null,null,null,1,0,0,1,1,{"$f":"IF(D120>$I$4,InvalidAssessmentScore())","v":false}]
[119,null,null,null,{"$error":"#DIV/0!"},{"$error":"#DIV/0!"},"YES",null,null,null,1,0,0,1,1,{"$f":"IF(D121>$I$4,InvalidAssessmentScore())","v":false}]
[120,null,null,null,{"$error":"#DIV/0!"},{"$error":"#DIV/0!"},"YES",null,null,null,1,0,0,1,1,{"$f":"IF(D122>$I$4,InvalidAssessmentScore())","v":false}]
[121,null,null,null,{"$error":"#DIV/0!"},{"$error":"#DIV/0!"},"YES",null,null,null,1,0,0,1,1,{"$f":"IF(D123>$I$4,InvalidAssessmentScore())","v":false}]
[122,null,null,null,{"$error":"#DIV/0!"},{"$error":"#DIV/0!"},"YES",null,null,null,1,0,0,1,1,{"$f":"IF(D124>$I$4,InvalidAssessmentScore())","v":false}]
[123,null,null,null,{"$error":"#DIV/0!"},{"$error":"#DIV/0!"},"YES",null,null,null,1,0,0,1,1,{"$f":"IF(D125>$I$4,InvalidAssessmentScore())","v":false}]
[124,null,null,null,{"$error":"#DIV/0!"},{"$error":"#DIV/0!"},"YES",null,null,null,1,0,0,1,1,{"$f":"IF(D126>$I$4,InvalidAssessmentScore())","v":false}]
[125,null,null,null,{"$error":"#DIV/0!"},{"$error":"#DIV/0!"},"YES",null,null,null,1,0,0,1,1,{"$f":"IF(D127>$I$4,InvalidAssessmentScore())","v":false}]
[126,null,null,null,{"$error":"#DIV/0!"},{"$error":"#DIV/0!"},"YES",null,null,null,1,0,0,1,1,{"$f":"IF(D128>$I$4,InvalidAssessmentScore())","v":false}]
[127,null,null,null,{"$error":"#DIV/0!"},{"$error":"#DIV/0!"},"YES",null,null,null,1,0,0,1,1,{"$f":"IF(D129>$I$4,InvalidAssessmentScore())","v":false}]
[128,null,null,null,{"$error":"#DIV/0!"},{"$error":"#DIV/0!"},"YES",null,null,null,1,0,0,1,1,{"$f":"IF(D130>$I$4,InvalidAssessmentScore())","v":false}]
[129,null,null,null,{"$f":"(D131/$I$4)","v":{"$error":"#DIV/0!"}},{"$f":"IF(E131>=$I$11,\"YES\", IF(AND(E131<$I$11,E131>=1%),\"NO\",IF(AND(E131=0%),\"INVALID\")))","v":{"$error":"#DIV/0!"}},"YES",null,null,null,1,0,0,1,1,{"$f":"IF(D131>$I$4,InvalidAssessmentScore())","v":false}]
[130,null,null,null,{"$error":"#DIV/0!"},{"$error":"#DIV/0!"},"YES",null,null,null,{"$f":"COUNTIF(G132,\"yes\")","v":1},{"$f":"COUNTIF(F132,\"yes\")","v":0},{"$f":"COUNTIF(F132,\"no\")","v":0},{"$f":"K132+L132","v":1},{"$f":"K132+M132","v":1},{"$f":"IF(D132>$I$4,InvalidAssessmentScore())","v":false}]
[131,null,null,null,{"$error":"#DIV/0!"},{"$error":"#DIV/0!"},"YES",null,null,null,1,0,0,1,1,{"$f":"IF(D133>$I$4,InvalidAssessmentScore())","v":false}]
[132,null,null,null,{"$error":"#DIV/0!"},{"$error":"#DIV/0!"},"YES",null,null,null,1,0,0,1,1,{"$f":"IF(D134>$I$4,InvalidAssessmentScore())","v":false}]
[133,null,null,null,{"$error":"#DIV/0!"},{"$error":"#DIV/0!"},"YES",null,null,null,1,0,0,1,1,{"$f":"IF(D135>$I$4,InvalidAssessmentScore())","v":false}]
[134,null,null,null,{"$error":"#DIV/0!"},{"$error":"#DIV/0!"},"YES",null,null,null,1,0,0,1,1,{"$f":"IF(D136>$I$4,InvalidAssessmentScore())","v":false}]
[135,null,null,null,{"$error":"#DIV/0!"},{"$error":"#DIV/0!"},"YES",null,null,null,1,0,0,1,1,{"$f":"IF(D137>$I$4,InvalidAssessmentScore())","v":false}]
[136,null,null,null,{"$error":"#DIV/0!"},{"$error":"#DIV/0!"},"YES",null,null,null,1,0,0,1,1,{"$f":"IF(D138>$I$4,InvalidAssessmentScore())","v":false}]
[137,null,null,null,{"$error":"#DIV/0!"},{"$error":"#DIV/0!"},"YES",null,null,null,1,0,0,1,1,{"$f":"IF(D139>$I$4,InvalidAssessmentScore())","v":false}]
[138,null,null,null,{"$error":"#DIV/0!"},{"$error":"#DIV/0!"},"YES",null,null,null,1,0,0,1,1,{"$f":"IF(D140>$I$4,InvalidAssessmentScore())","v":false}]
[139,null,null,null,{"$error":"#DIV/0!"},{"$error":"#DIV/0!"},"YES",null,null,null,1,0,0,1,1,{"$f":"IF(D141>$I$4,InvalidAssessmentScore())","v":false}]
[140,null,null,null,{"$error":"#DIV/0!"},{"$error":"#DIV/0!"},"YES",null,null,null,1,0,0,1,1,{"$f":"IF(D142>$I$4,InvalidAssessmentScore())","v":false}]
[141,null,null,null,{"$error":"#DIV/0!"},{"$error":"#DIV/0!"},"YES",null,null,null,1,0,0,1,1,{"$f":"IF(D143>$I$4,InvalidAssessmentScore())","v":false}]
[142,null,null,null,{"$error":"#DIV/0!"},{"$error":"#DIV/0!"},"YES",null,null,null,1,0,0,1,1,{"$f":"IF(D144>$I$4,InvalidAssessmentScore())","v":false}]
[143,null,null,null,{"$error":"#DIV/0!"},{"$error":"#DIV/0!"},"YES",null,null,null,1,0,0,1,1,{"$f":"IF(D145>$I$4,InvalidAssessmentScore())","v":false}]
[144,null,null,null,{"$error":"#DIV/0!"},{"$error":"#DIV/0!"},"YES",null,null,null,1,0,0,1,1,{"$f":"IF(D146>$I$4,InvalidAssessmentScore())","v":false}]
[145,null,null,null,{"$error":"#DIV/0!"},{"$error":"#DIV/0!"},"YES",null,null,null,1,0,0,1,1,{"$f":"IF(D147>$I$4,InvalidAssessmentScore())","v":false}]
[146,null,null,null,{"$error":"#DIV/0!"},{"$error":"#DIV/0!"},"YES",null,null,null,1,0,0,1,1,{"$f":"IF(D148>$I$4,InvalidAssessmentScore())","v":false}]
[147,null,null,null,{"$error":"#DIV/0!"},{"$error":"#DIV/0!"},"YES",null,null,null,1,0,0,1,1,{"$f":"IF(D149>$I$4,InvalidAssessmentScore())","v":false}]
[148,null,null,null,{"$error":"#DIV/0!"},{"$error":"#DIV/0!"},"YES",null,null,null,1,0,0,1,1,{"$f":"IF(D150>$I$4,InvalidAssessmentScore())","v":false}]
[149,null,null,null,{"$error":"#DIV/0!"},{"$error":"#DIV/0!"},"YES",null,null,null,1,0,0,1,1,{"$f":"IF(D151>$I$4,InvalidAssessmentScore())","v":false}]
[150,null,null,null,{"$error":"#DIV/0!"},{"$error":"#DIV/0!"},"YES",null,null,null,1,0,0,1,1,{"$f":"IF(D152>$I$4,InvalidAssessmentScore())","v":false}]
[151,null,null,null,{"$error":"#DIV/0!"},{"$error":"#DIV/0!"},"YES",null,null,null,1,0,0,1,1,{"$f":"IF(D153>$I$4,InvalidAssessmentScore())","v":false}]
[152,null,null,null,{"$error":"#DIV/0!"},{"$error":"#DIV/0!"},"YES",null,null,null,1,0,0,1,1,{"$f":"IF(D154>$I$4,InvalidAssessmentScore())","v":false}]
[153,null,null,null,{"$error":"#DIV/0!"},{"$error":"#DIV/0!"},"YES",null,null,null,1,0,0,1,1,{"$f":"IF(D155>$I$4,InvalidAssessmentScore())","v":false}]
[154,null,null,null,{"$error":"#DIV/0!"},{"$error":"#DIV/0!"},"YES",null,null,null,1,0,0,1,1,{"$f":"IF(D156>$I$4,InvalidAssessmentScore())","v":false}]
[155,null,null,null,{"$error":"#DIV/0!"},{"$error":"#DIV/0!"},"YES",null,null,null,1,0,0,1,1,{"$f":"IF(D157>$I$4,InvalidAssessmentScore())","v":false}]
[156,null,null,null,{"$error":"#DIV/0!"},{"$error":"#DIV/0!"},"YES",null,null,null,1,0,0,1,1,{"$f":"IF(D158>$I$4,InvalidAssessmentScore())","v":false}]
[157,null,null,null,{"$error":"#DIV/0!"},{"$error":"#DIV/0!"},"YES",null,null,null,1,0,0,1,1,{"$f":"IF(D159>$I$4,InvalidAssessmentScore())","v":false}]
[158,null,null,null,{"$error":"#DIV/0!"},{"$error":"#DIV/0!"},"YES",null,null,null,1,0,0,1,1,{"$f":"IF(D160>$I$4,InvalidAssessmentScore())","v":false}]
[159,null,null,null,{"$error":"#DIV/0!"},{"$error":"#DIV/0!"},"YES",null,null,null,1,0,0,1,1,{"$f":"IF(D161>$I$4,InvalidAssessmentScore())","v":false}]
[160,null,null,null,{"$error":"#DIV/0!"},{"$error":"#DIV/0!"},"YES",null,null,null,1,0,0,1,1,{"$f":"IF(D162>$I$4,InvalidAssessmentScore())","v":false}]
[161,null,null,null,{"$f":"(D163/$I$4)","v":{"$error":"#DIV/0!"}},{"$f":"IF(E163>=$I$11,\"YES\", IF(AND(E163<$I$11,E163>=1%),\"NO\",IF(AND(E163=0%),\"INVALID\")))","v":{"$error":"#DIV/0!"}},"YES",null,null,null,1,0,0,1,1,{"$f":"IF(D163>$I$4,InvalidAssessmentScore())","v":false}]
[162,null,null,null,{"$error":"#DIV/0!"},{"$error":"#DIV/0!"},"YES",null,null,null,1,0,0,1,1,{"$f":"IF(D164>$I$4,InvalidAssessmentScore())","v":false}]
[163,null,null,null,{"$error":"#DIV/0!"},{"$error":"#DIV/0!"},"YES",null,null,null,1,0,0,1,1,{"$f":"IF(D165>$I$4,InvalidAssessmentScore())","v":false}]
[164,null,null,null,{"$error":"#DIV/0!"},{"$error":"#DIV/0!"},"YES",null,null,null,1,0,0,1,1,{"$f":"IF(D166>$I$4,InvalidAssessmentScore())","v":false}]
[165,null,null,null,{"$error":"#DIV/0!"},{"$error":"#DIV/0!"},"YES",null,null,null,1,0,0,1,1,{"$f":"IF(D167>$I$4,InvalidAssessmentScore())","v":false}]
[166,null,null,null,{"$error":"#DIV/0!"},{"$error":"#DIV/0!"},"YES",null,null,null,1,0,0,1,1,{"$f":"IF(D168>$I$4,InvalidAssessmentScore())","v":false}]
[167,null,null,null,{"$error":"#DIV/0!"},{"$error":"#DIV/0!"},"YES",null,null,null,1,0,0,1,1,{"$f":"IF(D169>$I$4,InvalidAssessmentScore())","v":false}]
[168,null,null,null,{"$error":"#DIV/0!"},{"$error":"#DIV/0!"},"YES",null,null,null,1,0,0,1,1,{"$f":"IF(D170>$I$4,InvalidAssessmentScore())","v":false}]
[169,null,null,null,{"$error":"#DIV/0!"},{"$error":"#DIV/0!"},"YES",null,null,null,1,0,0,1,1,{"$f":"IF(D171>$I$4,InvalidAssessmentScore())","v":false}]
[170,null,null,null,{"$error":"#DIV/0!"},{"$error":"#DIV/0!"},"YES",null,null,null,1,0,0,1,1,{"$f":"IF(D172>$I$4,InvalidAssessmentScore())","v":false}]
[171,null,null,null,{"$error":"#DIV/0!"},{"$error":"#DIV/0!"},"YES",null,null,null,1,0,0,1,1,{"$f":"IF(D173>$I$4,InvalidAssessmentScore())","v":false}]
[172,null,null,null,{"$error":"#DIV/0!"},{"$error":"#DIV/0!"},"YES",null,null,null,1,0,0,1,1,{"$f":"IF(D174>$I$4,InvalidAssessmentScore())","v":false}]
[173,null,null,null,{"$error":"#DIV/0!"},{"$error":"#DIV/0!"},"YES",null,null,null,1,0,0,1,1,{"$f":"IF(D175>$I$4,InvalidAssessmentScore())","v":false}]
[174,null,null,null,{"$error":"#DIV/0!"},{"$error":"#DIV/0!"},"YES",null,null,null,1,0,0,1,1,{"$f":"IF(D176>$I$4,InvalidAssessmentScore())","v":false}]
[175,null,null,null,{"$error":"#DIV/0!"},{"$error":"#DIV/0!"},"YES",null,null,null,1,0,0,1,1,{"$f":"IF(D177>$I$4,InvalidAssessmentScore())","v":false}]
[176,null,null,null,{"$error":"#DIV/0!"},{"$error":"#DIV/0!"},"YES",null,null,null,1,0,0,1,1,{"$f":"IF(D178>$I$4,InvalidAssessmentScore())","v":false}]
[177,null,null,null,{"$error":"#DIV/0!"},{"$error":"#DIV/0!"},"YES",null,null,null,1,0,0,1,1,{"$f":"IF(D179>$I$4,InvalidAssessmentScore())","v":false}]
[178,null,null,null,{"$error":"#DIV/0!"},{"$error":"#DIV/0!"},"YES",null,null,null,1,0,0,1,1,{"$f":"IF(D180>$I$4,InvalidAssessmentScore())","v":false}]
[179,null,null,null,{"$error":"#DIV/0!"},{"$error":"#DIV/0!"},"YES",null,null,null,1,0,0,1,1,{"$f":"IF(D181>$I$4,InvalidAssessmentScore())","v":false}]
[180,null,null,null,{"$error":"#DIV/0!"},{"$error":"#DIV/0!"},"YES",null,null,null,1,0,0,1,1,{"$f":"IF(D182>$I$4,InvalidAssessmentScore())","v":false}]
[181,null,null,null,{"$error":"#DIV/0!"},{"$error":"#DIV/0!"},"YES",null,null,null,1,0,0,1,1,{"$f":"IF(D183>$I$4,InvalidAssessmentScore())","v":false}]
[182,null,null,null,{"$error":"#DIV/0!"},{"$error":"#DIV/0!"},"YES",null,null,null,1,0,0,1,1,{"$f":"IF(D184>$I$4,InvalidAssessmentScore())","v":false}]
[183,null,null,null,{"$error":"#DIV/0!"},{"$error":"#DIV/0!"},"YES",null,null,null,1,0,0,1,1,{"$f":"IF(D185>$I$4,InvalidAssessmentScore())","v":false}]
[184,null,null,null,{"$error":"#DIV/0!"},{"$error":"#DIV/0!"},"YES",null,null,null,1,0,0,1,1,{"$f":"IF(D186>$I$4,InvalidAssessmentScore())","v":false}]
[185,null,null,null,{"$error":"#DIV/0!"},{"$error":"#DIV/0!"},"YES",null,null,null,1,0,0,1,1,{"$f":"IF(D187>$I$4,InvalidAssessmentScore())","v":false}]
[186,null,null,null,{"$error":"#DIV/0!"},{"$error":"#DIV/0!"},"YES",null,null,null,1,0,0,1,1,{"$f":"IF(D188>$I$4,InvalidAssessmentScore())","v":false}]
[187,null,null,null,{"$error":"#DIV/0!"},{"$error":"#DIV/0!"},"YES",null,null,null,1,0,0,1,1,{"$f":"IF(D189>$I$4,InvalidAssessmentScore())","v":false}]
[188,null,null,null,{"$error":"#DIV/0!"},{"$error":"#DIV/0!"},"YES",null,null,null,1,0,0,1,1,{"$f":"IF(D190>$I$4,InvalidAssessmentScore())","v":false}]
[189,null,null,null,{"$error":"#DIV/0!"},{"$error":"#DIV/0!"},"YES",null,null,null,1,0,0,1,1,{"$f":"IF(D191>$I$4,InvalidAssessmentScore())","v":false}]
[190,null,null,null,{"$error":"#DIV/0!"},{"$error":"#DIV/0!"},"YES",null,null,null,1,0,0,1,1,{"$f":"IF(D192>$I$4,InvalidAssessmentScore())","v":false}]
[191,null,null,null,{"$error":"#DIV/0!"},{"$error":"#DIV/0!"},"YES",null,null,null,1,0,0,1,1,{"$f":"IF(D193>$I$4,InvalidAssessmentScore())","v":false}]
[192,null,null,null,{"$error":"#DIV/0!"},{"$error":"#DIV/0!"},"YES",null,null,null,1,0,0,1,1,{"$f":"IF(D194>$I$4,InvalidAssessmentScore())","v":false}]
[193,null,null,null,{"$error":"#DIV/0!"},{"$error":"#DIV/0!"},"YES",null,null,null,1,0,0,1,1,{"$f":"IF(D195>$I$4,InvalidAssessmentScore())","v":false}]
[194,null,null,null,{"$error":"#DIV/0!"},{"$error":"#DIV/0!"},"YES",null,null,null,{"$f":"COUNTIF(G196,\"yes\")","v":1},{"$f":"COUNTIF(F196,\"yes\")","v":0},{"$f":"COUNTIF(F196,\"no\")","v":0},{"$f":"K196+L196","v":1},{"$f":"K196+M196","v":1},{"$f":"IF(D196>$I$4,InvalidAssessmentScore())","v":false}]
[195,null,null,null,{"$error":"#DIV/0!"},{"$error":"#DIV/0!"},"YES",null,null,null,1,0,0,1,1,{"$f":"IF(D197>$I$4,InvalidAssessmentScore())","v":false}]
[196,null,null,null,{"$error":"#DIV/0!"},{"$error":"#DIV/0!"},"YES",null,null,null,1,0,0,1,1,{"$f":"IF(D198>$I$4,InvalidAssessmentScore())","v":false}]
[197,null,null,null,{"$error":"#DIV/0!"},{"$error":"#DIV/0!"},"YES",null,null,null,1,0,0,1,1,{"$f":"IF(D199>$I$4,InvalidAssessmentScore())","v":false}]
[198,null,null,null,{"$error":"#DIV/0!"},{"$error":"#DIV/0!"},"YES",null,null,null,1,0,0,1,1,{"$f":"IF(D200>$I$4,InvalidAssessmentScore())","v":false}]
[199,null,null,null,{"$error":"#DIV/0!"},{"$error":"#DIV/0!"},"YES",null,null,null,1,0,0,1,1,{"$f":"IF(D201>$I$4,InvalidAssessmentScore())","v":false}]
[200,null,null,null,{"$error":"#DIV/0!"},{"$error":"#DIV/0!"},"YES",null,null,null,1,0,0,1,1,{"$f":"IF(D202>$I$4,InvalidAssessmentScore())","v":false}]
[201,null,null,null,{"$error":"#DIV/0!"},{"$error":"#DIV/0!"},"YES",null,null,null,1,0,0,1,1,{"$f":"IF(D203>$I$4,InvalidAssessmentScore())","v":false}]
[202,null,null,null,{"$error":"#DIV/0!"},{"$error":"#DIV/0!"},"YES",null,null,null,1,0,0,1,1,{"$f":"IF(D204>$I$4,InvalidAssessmentScore())","v":false}]
[203,null,null,null,{"$error":"#DIV/0!"},{"$error":"#DIV/0!"},"YES",null,null,null,1,0,0,1,1,{"$f":"IF(D205>$I$4,InvalidAssessmentScore())","v":false}]
[204,null,null,null,{"$error":"#DIV/0!"},{"$error":"#DIV/0!"},"YES",null,null,null,1,0,0,1,1,{"$f":"IF(D206>$I$4,InvalidAssessmentScore())","v":false}]
[205,null,null,null,{"$error":"#DIV/0!"},{"$error":"#DIV/0!"},"YES",null,null,null,1,0,0,1,1,{"$f":"IF(D207>$I$4,InvalidAssessmentScore())","v":false}]
[206,null,null,null,{"$error":"#DIV/0!"},{"$error":"#DIV/0!"},"YES",null,null,null,1,0,0,1,1,{"$f":"IF(D208>$I$4,InvalidAssessmentScore())","v":false}]
[207,null,null,null,{"$error":"#DIV/0!"},{"$error":"#DIV/0!"},"YES",null,null,null,1,0,0,1,1,{"$f":"IF(D209>$I$4,InvalidAssessmentScore())","v":false}]
[208,null,null,null,{"$error":"#DIV/0!"},{"$error":"#DIV/0!"},"YES",null,null,null,1,0,0,1,1,{"$f":"IF(D210>$I$4,InvalidAssessmentScore())","v":false}]
[209,null,null,null,{"$error":"#DIV/0!"},{"$error":"#DIV/0!"},"YES",null,null,null,1,0,0,1,1,{"$f":"IF(D211>$I$4,InvalidAssessmentScore())","v":false}]
[210,null,null,null,{"$error":"#DIV/0!"},{"$error":"#DIV/0!"},"YES",null,null,null,1,0,0,1,1,{"$f":"IF(D212>$I$4,InvalidAssessmentScore())","v":false}]
[211,null,null,null,{"$error":"#DIV/0!"},{"$error":"#DIV/0!"},"YES",null,null,null,1,0,0,1,1,{"$f":"IF(D213>$I$4,InvalidAssessmentScore())","v":false}]
[212,null,null,null,{"$error":"#DIV/0!"},{"$error":"#DIV/0!"},"YES",null,null,null,1,0,0,1,1,{"$f":"IF(D214>$I$4,InvalidAssessmentScore())","v":false}]
[213,null,null,null,{"$error":"#DIV/0!"},{"$error":"#DIV/0!"},"YES",null,null,null,1,0,0,1,1,{"$f":"IF(D215>$I$4,InvalidAssessmentScore())","v":false}]
[214,null,null,null,{"$error":"#DIV/0!"},{"$error":"#DIV/0!"},"YES",null,null,null,1,0,0,1,1,{"$f":"IF(D216>$I$4,InvalidAssessmentScore())","v":false}]
[215,null,null,null,{"$error":"#DIV/0!"},{"$error":"#DIV/0!"},"YES",null,null,null,1,0,0,1,1,{"$f":"IF(D217>$I$4,InvalidAssessmentScore())","v":false}]
[216,null,null,null,{"$error":"#DIV/0!"},{"$error":"#DIV/0!"},"YES",null,null,null,1,0,0,1,1,{"$f":"IF(D218>$I$4,InvalidAssessmentScore())","v":false}]
[217,null,null,null,{"$error":"#DIV/0!"},{"$error":"#DIV/0!"},"YES",null,null,null,1,0,0,1,1,{"$f":"IF(D219>$I$4,InvalidAssessmentScore())","v":false}]
[218,null,null,null,{"$error":"#DIV/0!"},{"$error":"#DIV/0!"},"YES",null,null,null,1,0,0,1,1,{"$f":"IF(D220>$I$4,InvalidAssessmentScore())","v":false}]
[219,null,null,null,{"$error":"#DIV/0!"},{"$error":"#DIV/0!"},"YES",null,null,null,1,0,0,1,1,{"$f":"IF(D221>$I$4,InvalidAssessmentScore())","v":false}]
[220,null,null,null,{"$error":"#DIV/0!"},{"$error":"#DIV/0!"},"YES",null,null,null,1,0,0,1,1,{"$f":"IF(D222>$I$4,InvalidAssessmentScore())","v":false}]
[221,null,null,null,{"$error":"#DIV/0!"},{"$error":"#DIV/0!"},"YES",null,null,null,1,0,0,1,1,{"$f":"IF(D223>$I$4,InvalidAssessmentScore())","v":false}]
[222,null,null,null,{"$error":"#DIV/0!"},{"$error":"#DIV/0!"},"YES",null,null,null,1,0,0,1,1,{"$f":"IF(D224>$I$4,InvalidAssessmentScore())","v":false}]
[223,null,null,null,{"$error":"#DIV/0!"},{"$error":"#DIV/0!"},"YES",null,null,null,1,0,0,1,1,{"$f":"IF(D225>$I$4,InvalidAssessmentScore())","v":false}]
[224,null,null,null,{"$error":"#DIV/0!"},{"$error":"#DIV/0!"},"YES",null,null,null,1,0,0,1,1,{"$f":"IF(D226>$I$4,InvalidAssessmentScore())","v":false}]
[225,null,null,null,{"$f":"(D227/$I$4)","v":{"$error":"#DIV/0!"}},{"$f":"IF(E227>=$I$11,\"YES\", IF(AND(E227<$I$11,E227>=1%),\"NO\",IF(AND(E227=0%),\"INVALID\")))","v":{"$error":"#DIV/0!"}},"YES",null,null,null,1,0,0,1,1,{"$f":"IF(D227>$I$4,InvalidAssessmentScore())","v":false}]
[226,null,null,null,{"$error":"#DIV/0!"},{"$error":"#DIV/0!"},"YES",null,null,null,1,0,0,1,1,{"$f":"IF(D228>$I$4,InvalidAssessmentScore())","v":false}]
[227,null,null,null,{"$error":"#DIV/0!"},{"$error":"#DIV/0!"},"YES",null,null,null,1,0,0,1,1,{"$f":"IF(D229>$I$4,InvalidAssessmentScore())","v":false}]
[228,null,null,null,{"$error":"#DIV/0!"},{"$error":"#DIV/0!"},"YES",null,null,null,1,0,0,1,1,{"$f":"IF(D230>$I$4,InvalidAssessmentScore())","v":false}]
[229,null,null,null,{"$error":"#DIV/0!"},{"$error":"#DIV/0!"},"YES",null,null,null,1,0,0,1,1,{"$f":"IF(D231>$I$4,InvalidAssessmentScore())","v":false}]
[230,null,null,null,{"$error":"#DIV/0!"},{"$error":"#DIV/0!"},"YES",null,null,null,1,0,0,1,1,{"$f":"IF(D232>$I$4,InvalidAssessmentScore())","v":false}]
[231,null,null,null,{"$error":"#DIV/0!"},{"$error":"#DIV/0!"},"YES",null,null,null,1,0,0,1,1,{"$f":"IF(D233>$I$4,InvalidAssessmentScore())","v":false}]
[232,null,null,null,{"$error":"#DIV/0!"},{"$error":"#DIV/0!"},"YES",null,null,null,1,0,0,1,1,{"$f":"IF(D234>$I$4,InvalidAssessmentScore())","v":false}]
[233,null,null,null,{"$error":"#DIV/0!"},{"$error":"#DIV/0!"},"YES",null,null,null,1,0,0,1,1,{"$f":"IF(D235>$I$4,InvalidAssessmentScore())","v":false}]
[234,null,null,null,{"$error":"#DIV/0!"},{"$error":"#DIV/0!"},"YES",null,null,null,1,0,0,1,1,{"$f":"IF(D236>$I$4,InvalidAssessmentScore())","v":false}]
[235,null,null,null,{"$error":"#DIV/0!"},{"$error":"#DIV/0!"},"YES",null,null,null,1,0,0,1,1,{"$f":"IF(D237>$I$4,InvalidAssessmentScore())","v":false}]
[236,null,null,null,{"$error":"#DIV/0!"},{"$error":"#DIV/0!"},"YES",null,null,null,1,0,0,1,1,{"$f":"IF(D238>$I$4,InvalidAssessmentScore())","v":false}]
[237,null,null,null,{"$error":"#DIV/0!"},{"$error":"#DIV/0!"},"YES",null,null,null,1,0,0,1,1,{"$f":"IF(D239>$I$4,InvalidAssessmentScore())","v":false}]
[238,null,null,null,{"$error":"#DIV/0!"},{"$error":"#DIV/0!"},"YES",null,null,null,1,0,0,1,1,{"$f":"IF(D240>$I$4,InvalidAssessmentScore())","v":false}]
[239,null,null,null,{"$error":"#DIV/0!"},{"$error":"#DIV/0!"},"YES",null,null,null,1,0,0,1,1,{"$f":"IF(D241>$I$4,InvalidAssessmentScore())","v":false}]
[240,null,null,null,{"$error":"#DIV/0!"},{"$error":"#DIV/0!"},"YES",null,null,null,1,0,0,1,1,{"$f":"IF(D242>$I$4,InvalidAssessmentScore())","v":false}]
[241,null,null,null,{"$error":"#DIV/0!"},{"$error":"#DIV/0!"},"YES",null,null,null,1,0,0,1,1,{"$f":"IF(D243>$I$4,InvalidAssessmentScore())","v":false}]
[242,null,null,null,{"$error":"#DIV/0!"},{"$error":"#DIV/0!"},"YES",null,null,null,1,0,0,1,1,{"$f":"IF(D244>$I$4,InvalidAssessmentScore())","v":false}]
[243,null,null,null,{"$error":"#DIV/0!"},{"$error":"#DIV/0!"},"YES",null,null,null,1,0,0,1,1,{"$f":"IF(D245>$I$4,InvalidAssessmentScore())","v":false}]
[244,null,null,null,{"$error":"#DIV/0!"},{"$error":"#DIV/0!"},"YES",null,null,null,1,0,0,1,1,{"$f":"IF(D246>$I$4,InvalidAssessmentScore())","v":false}]
[245,null,null,null,{"$error":"#DIV/0!"},{"$error":"#DIV/0!"},"YES",null,null,null,1,0,0,1,1,{"$f":"IF(D247>$I$4,InvalidAssessmentScore())","v":false}]
[246,null,null,null,{"$error":"#DIV/0!"},{"$error":"#DIV/0!"},"YES",null,null,null,1,0,0,1,1,{"$f":"IF(D248>$I$4,InvalidAssessmentScore())","v":false}]
[247,null,null,null,{"$error":"#DIV/0!"},{"$error":"#DIV/0!"},"YES",null,null,null,1,0,0,1,1,{"$f":"IF(D249>$I$4,InvalidAssessmentScore())","v":false}]
[248,null,null,null,{"$error":"#DIV/0!"},{"$error":"#DIV/0!"},"YES",null,null,null,1,0,0,1,1,{"$f":"IF(D250>$I$4,InvalidAssessmentScore())","v":false}]
[249,null,null,null,{"$error":"#DIV/0!"},{"$error":"#DIV/0!"},"YES",null,null,null,1,0,0,1,1,{"$f":"IF(D251>$I$4,InvalidAssessmentScore())","v":false}]
[250,null,null,null,{"$error":"#DIV/0!"},{"$error":"#DIV/0!"},"YES",null,null,null,1,0,0,1,1,{"$f":"IF(D252>$I$4,InvalidAssessmentScore())","v":false}]
[251,null,null,null,{"$error":"#DIV/0!"},{"$error":"#DIV/0!"},"YES",null,null,null,1,0,0,1,1,{"$f":"IF(D253>$I$4,InvalidAssessmentScore())","v":false}]
[252,null,null,null,{"$error":"#DIV/0!"},{"$error":"#DIV/0!"},"YES",null,null,null,1,0,0,1,1,{"$f":"IF(D254>$I$4,InvalidAssessmentScore())","v":false}]
[253,null,null,null,{"$error":"#DIV/0!"},{"$error":"#DIV/0!"},"YES",null,null,null,1,0,0,1,1,{"$f":"IF(D255>$I$4,InvalidAssessmentScore())","v":false}]
[254,null,null,null,{"$error":"#DIV/0!"},{"$error":"#DIV/0!"},"YES",null,null,null,1,0,0,1,1,{"$f":"IF(D256>$I$4,InvalidAssessmentScore())","v":false}]
[255,null,null,null,{"$error":"#DIV/0!"},{"$error":"#DIV/0!"},"YES",null,null,null,1,0,0,1,1,{"$f":"IF(D257>$I$4,InvalidAssessmentScore())","v":false}]
[256,null,null,null,{"$error":"#DIV/0!"},{"$error":"#DIV/0!"},"YES",null,null,null,1,0,0,1,1,{"$f":"IF(D258>$I$4,InvalidAssessmentScore())","v":false}]
[257,null,null,null,{"$error":"#DIV/0!"},{"$error":"#DIV/0!"},"YES",null,null,null,1,0,0,1,1,{"$f":"IF(D259>$I$4,InvalidAssessmentScore())","v":false}]
[258,null,null,null,{"$error":"#DIV/0!"},{"$error":"#DIV/0!"},"YES",null,null,null,{"$f":"COUNTIF(G260,\"yes\")","v":1},{"$f":"COUNTIF(F260,\"yes\")","v":0},{"$f":"COUNTIF(F260,\"no\")","v":0},{"$f":"K260+L260","v":1},{"$f":"K260+M260","v":1},{"$f":"IF(D260>$I$4,InvalidAssessmentScore())","v":false}]
[259,null,null,null,{"$error":"#DIV/0!"},{"$error":"#DIV/0!"},"YES",null,null,null,1,0,0,1,1,{"$f":"IF(D261>$I$4,InvalidAssessmentScore())","v":false}]
[260,null,null,null,{"$error":"#DIV/0!"},{"$error":"#DIV/0!"},"YES",null,null,null,1,0,0,1,1,{"$f":"IF(D262>$I$4,InvalidAssessmentScore())","v":false}]
[261,null,null,null,{"$error":"#DIV/0!"},{"$error":"#DIV/0!"},"YES",null,null,null,1,0,0,1,1,{"$f":"IF(D263>$I$4,InvalidAssessmentScore())","v":false}]
[262,null,null,null,{"$error":"#DIV/0!"},{"$error":"#DIV/0!"},"YES",null,null,null,1,0,0,1,1,{"$f":"IF(D264>$I$4,InvalidAssessmentScore())","v":false}]
[263,null,null,null,{"$error":"#DIV/0!"},{"$error":"#DIV/0!"},"YES",null,null,null,1,0,0,1,1,{"$f":"IF(D265>$I$4,InvalidAssessmentScore())","v":false}]
[264,null,null,null,{"$error":"#DIV/0!"},{"$error":"#DIV/0!"},"YES",null,null,null,1,0,0,1,1,{"$f":"IF(D266>$I$4,InvalidAssessmentScore())","v":false}]
[265,null,null,null,{"$error":"#DIV/0!"},{"$error":"#DIV/0!"},"YES",null,null,null,1,0,0,1,1,{"$f":"IF(D267>$I$4,InvalidAssessmentScore())","v":false}]
[266,null,null,null,{"$error":"#DIV/0!"},{"$error":"#DIV/0!"},"YES",null,null,null,1,0,0,1,1,{"$f":"IF(D268>$I$4,InvalidAssessmentScore())","v":false}]
[267,null,null,null,{"$error":"#DIV/0!"},{"$error":"#DIV/0!"},"YES",null,null,null,1,0,0,1,1,{"$f":"IF(D269>$I$4,InvalidAssessmentScore())","v":false}]
[268,null,null,null,{"$error":"#DIV/0!"},{"$error":"#DIV/0!"},"YES",null,null,null,1,0,0,1,1,{"$f":"IF(D270>$I$4,InvalidAssessmentScore())","v":false}]
[269,null,null,null,{"$error":"#DIV/0!"},{"$error":"#DIV/0!"},"YES",null,null,null,1,0,0,1,1,{"$f":"IF(D271>$I$4,InvalidAssessmentScore())","v":false}]
[270,null,null,null,{"$error":"#DIV/0!"},{"$error":"#DIV/0!"},"YES",null,null,null,1,0,0,1,1,{"$f":"IF(D272>$I$4,InvalidAssessmentScore())","v":false}]
[271,null,null,null,{"$error":"#DIV/0!"},{"$error":"#DIV/0!"},"YES",null,null,null,1,0,0,1,1,{"$f":"IF(D273>$I$4,InvalidAssessmentScore())","v":false}]
[272,null,null,null,{"$error":"#DIV/0!"},{"$error":"#DIV/0!"},"YES",null,null,null,1,0,0,1,1,{"$f":"IF(D274>$I$4,InvalidAssessmentScore())","v":false}]
[273,null,null,null,{"$error":"#DIV/0!"},{"$error":"#DIV/0!"},"YES",null,null,null,1,0,0,1,1,{"$f":"IF(D275>$I$4,InvalidAssessmentScore())","v":false}]
[274,null,null,null,{"$error":"#DIV/0!"},{"$error":"#DIV/0!"},"YES",null,null,null,1,0,0,1,1,{"$f":"IF(D276>$I$4,InvalidAssessmentScore())","v":false}]
[275,null,null,null,{"$error":"#DIV/0!"},{"$error":"#DIV/0!"},"YES",null,null,null,1,0,0,1,1,{"$f":"IF(D277>$I$4,InvalidAssessmentScore())","v":false}]
[276,null,null,null,{"$error":"#DIV/0!"},{"$error":"#DIV/0!"},"YES",null,null,null,1,0,0,1,1,{"$f":"IF(D278>$I$4,InvalidAssessmentScore())","v":false}]
[277,null,null,null,{"$error":"#DIV/0!"},{"$error":"#DIV/0!"},"YES",null,null,null,1,0,0,1,1,{"$f":"IF(D279>$I$4,InvalidAssessmentScore())","v":false}]
[278,null,null,null,{"$error":"#DIV/0!"},{"$error":"#DIV/0!"},"YES",null,null,null,1,0,0,1,1,{"$f":"IF(D280>$I$4,InvalidAssessmentScore())","v":false}]
[279,null,null,null,{"$error":"#DIV/0!"},{"$error":"#DIV/0!"},"YES",null,null,null,1,0,0,1,1,{"$f":"IF(D281>$I$4,InvalidAssessmentScore())","v":false}]
[280,null,null,null,{"$error":"#DIV/0!"},{"$error":"#DIV/0!"},"YES",null,null,null,1,0,0,1,1,{"$f":"IF(D282>$I$4,InvalidAssessmentScore())","v":false}]
[281,null,null,null,{"$error":"#DIV/0!"},{"$error":"#DIV/0!"},"YES",null,null,null,1,0,0,1,1,{"$f":"IF(D283>$I$4,InvalidAssessmentScore())","v":false}]
[282,null,null,null,{"$error":"#DIV/0!"},{"$error":"#DIV/0!"},"YES",null,null,null,1,0,0,1,1,{"$f":"IF(D284>$I$4,InvalidAssessmentScore())","v":false}]
[283,null,null,null,{"$error":"#DIV/0!"},{"$error":"#DIV/0!"},"YES",null,null,null,1,0,0,1,1,{"$f":"IF(D285>$I$4,InvalidAssessmentScore())","v":false}]
[284,null,null,null,{"$error":"#DIV/0!"},{"$error":"#DIV/0!"},"YES",null,null,null,1,0,0,1,1,{"$f":"IF(D286>$I$4,InvalidAssessmentScore())","v":false}]
[285,null,null,null,{"$error":"#DIV/0!"},{"$error":"#DIV/0!"},"YES",null,null,null,1,0,0,1,1,{"$f":"IF(D287>$I$4,InvalidAssessmentScore())","v":false}]
[286,null,null,null,{"$error":"#DIV/0!"},{"$error":"#DIV/0!"},"YES",null,null,null,1,0,0,1,1,{"$f":"IF(D288>$I$4,InvalidAssessmentScore())","v":false}]
[287,null,null,null,{"$error":"#DIV/0!"},{"$error":"#DIV/0!"},"YES",null,null,null,1,0,0,1,1,{"$f":"IF(D289>$I$4,InvalidAssessmentScore())","v":false}]
[288,null,null,null,{"$error":"#DIV/0!"},{"$error":"#DIV/0!"},"YES",null,null,null,1,0,0,1,1,{"$f":"IF(D290>$I$4,InvalidAssessmentScore())","v":false}]
[289,null,null,null,{"$f":"(D291/$I$4)","v":{"$error":"#DIV/0!"}},{"$f":"IF(E291>=$I$11,\"YES\", IF(AND(E291<$I$11,E291>=1%),\"NO\",IF(AND(E291=0%),\"INVALID\")))","v":{"$error":"#DIV/0!"}},"YES",null,null,null,1,0,0,1,1,{"$f":"IF(D291>$I$4,InvalidAssessmentScore())","v":false}]
[290,null,null,null,{"$error":"#DIV/0!"},{"$error":"#DIV/0!"},"YES",null,null,null,1,0,0,1,1,{"$f":"IF(D292>$I$4,InvalidAssessmentScore())","v":false}]
[291,null,null,null,{"$error":"#DIV/0!"},{"$error":"#DIV/0!"},"YES",null,null,null,1,0,0,1,1,{"$f":"IF(D293>$I$4,InvalidAssessmentScore())","v":false}]
[292,null,null,null,{"$error":"#DIV/0!"},{"$error":"#DIV/0!"},"YES",null,null,null,1,0,0,1,1,{"$f":"IF(D294>$I$4,InvalidAssessmentScore())","v":false}]
[293,null,null,null,{"$error":"#DIV/0!"},{"$error":"#DIV/0!"},"YES",null,null,null,1,0,0,1,1,{"$f":"IF(D295>$I$4,InvalidAssessmentScore())","v":false}]
[294,null,null,null,{"$error":"#DIV/0!"},{"$error":"#DIV/0!"},"YES",null,null,null,1,0,0,1,1,{"$f":"IF(D296>$I$4,InvalidAssessmentScore())","v":false}]
[295,null,null,null,{"$error":"#DIV/0!"},{"$error":"#DIV/0!"},"YES",null,null,null,1,0,0,1,1,{"$f":"IF(D297>$I$4,InvalidAssessmentScore())","v":false}]
[296,null,null,null,{"$error":"#DIV/0!"},{"$error":"#DIV/0!"},"YES",null,null,null,1,0,0,1,1,{"$f":"IF(D298>$I$4,InvalidAssessmentScore())","v":false}]
[297,null,null,null,{"$error":"#DIV/0!"},{"$error":"#DIV/0!"},"YES",null,null,null,1,0,0,1,1,{"$f":"IF(D299>$I$4,InvalidAssessmentScore())","v":false}]
[298,null,null,null,{"$error":"#DIV/0!"},{"$error":"#DIV/0!"},"YES",null,null,null,1,0,0,1,1,{"$f":"IF(D300>$I$4,InvalidAssessmentScore())","v":false}]
[299,null,null,null,{"$error":"#DIV/0!"},{"$error":"#DIV/0!"},"YES",null,null,null,1,0,0,1,1,{"$f":"IF(D301>$I$4,InvalidAssessmentScore())","v":false}]
[300,null,null,null,{"$error":"#DIV/0!"},{"$error":"#DIV/0!"},"YES",null,null,null,1,0,0,1,1,{"$f":"IF(D302>$I$4,InvalidAssessmentScore())","v":false}]
[301,null,null,null,{"$error":"#DIV/0!"},{"$error":"#DIV/0!"},"YES",null,null,null,1,0,0,1,1,{"$f":"IF(D303>$I$4,InvalidAssessmentScore())","v":false}]
[302,null,null,null,{"$error":"#DIV/0!"},{"$error":"#DIV/0!"},"YES",null,null,null,1,0,0,1,1,{"$f":"IF(D304>$I$4,InvalidAssessmentScore())","v":false}]
[303,null,null,null,{"$error":"#DIV/0!"},{"$error":"#DIV/0!"},"YES",null,null,null,1,0,0,1,1,{"$f":"IF(D305>$I$4,InvalidAssessmentScore())","v":false}]
[304,null,null,null,{"$error":"#DIV/0!"},{"$error":"#DIV/0!"},"YES",null,null,null,1,0,0,1,1,{"$f":"IF(D306>$I$4,InvalidAssessmentScore())","v":false}]
[305,null,null,null,{"$error":"#DIV/0!"},{"$error":"#DIV/0!"},"YES",null,null,null,1,0,0,1,1,{"$f":"IF(D307>$I$4,InvalidAssessmentScore())","v":false}]
[306,null,null,null,{"$error":"#DIV/0!"},{"$error":"#DIV/0!"},"YES",null,null,null,1,0,0,1,1,{"$f":"IF(D308>$I$4,InvalidAssessmentScore())","v":false}]
[307,null,null,null,{"$error":"#DIV/0!"},{"$error":"#DIV/0!"},"YES",null,null,null,1,0,0,1,1,{"$f":"IF(D309>$I$4,InvalidAssessmentScore())","v":false}]
[308,null,null,null,{"$error":"#DIV/0!"},{"$error":"#DIV/0!"},"YES",null,null,null,1,0,0,1,1,{"$f":"IF(D310>$I$4,InvalidAssessmentScore())","v":false}]
[309,null,null,null,{"$error":"#DIV/0!"},{"$error":"#DIV/0!"},"YES",null,null,null,1,0,0,1,1,{"$f":"IF(D311>$I$4,InvalidAssessmentScore())","v":false}]
[310,null,null,null,{"$error":"#DIV/0!"},{"$error":"#DIV/0!"},"YES",null,null,null,1,0,0,1,1,{"$f":"IF(D312>$I$4,InvalidAssessmentScore())","v":false}]
[311,null,null,null,{"$error":"#DIV/0!"},{"$error":"#DIV/0!"},"YES",null,null,null,1,0,0,1,1,{"$f":"IF(D313>$I$4,InvalidAssessmentScore())","v":false}]
[312,null,null,null,{"$error":"#DIV/0!"},{"$error":"#DIV/0!"},"YES",null,null,null,1,0,0,1,1,{"$f":"IF(D314>$I$4,InvalidAssessmentScore())","v":false}]
[313,null,null,null,{"$error":"#DIV/0!"},{"$error":"#DIV/0!"},"YES",null,null,null,1,0,0,1,1,{"$f":"IF(D315>$I$4,InvalidAssessmentScore())","v":false}]
[314,null,null,null,{"$error":"#DIV/0!"},{"$error":"#DIV/0!"},"YES",null,null,null,1,0,0,1,1,{"$f":"IF(D316>$I$4,InvalidAssessmentScore())","v":false}]
[315,null,null,null,{"$error":"#DIV/0!"},{"$error":"#DIV/0!"},"YES",null,null,null,1,0,0,1,1,{"$f":"IF(D317>$I$4,InvalidAssessmentScore())","v":false}]
[316,null,null,null,{"$error":"#DIV/0!"},{"$error":"#DIV/0!"},"YES",null,null,null,1,0,0,1,1,{"$f":"IF(D318>$I$4,InvalidAssessmentScore())","v":false}]
[317,null,null,null,{"$error":"#DIV/0!"},{"$error":"#DIV/0!"},"YES",null,null,null,1,0,0,1,1,{"$f":"IF(D319>$I$4,InvalidAssessmentScore())","v":false}]
[318,null,null,null,{"$error":"#DIV/0!"},{"$error":"#DIV/0!"},"YES",null,null,null,1,0,0,1,1,{"$f":"IF(D320>$I$4,InvalidAssessmentScore())","v":false}]
[319,null,null,null,{"$error":"#DIV/0!"},{"$error":"#DIV/0!"},"YES",null,null,null,1,0,0,1,1,{"$f":"IF(D321>$I$4,InvalidAssessmentScore())","v":false}]
[320,null,null,null,{"$error":"#DIV/0!"},{"$error":"#DIV/0!"},"YES",null,null,null,1,0,0,1,1,{"$f":"IF(D322>$I$4,InvalidAssessmentScore())","v":false}]
[321,null,null,null,{"$error":"#DIV/0!"},{"$error":"#DIV/0!"},"YES",null,null,null,1,0,0,1,1,{"$f":"IF(D323>$I$4,InvalidAssessmentScore())","v":false}]
[322,null,null,null,{"$error":"#DIV/0!"},{"$error":"#DIV/0!"},"YES",null,null,null,{"$f":"COUNTIF(G324,\"yes\")","v":1},{"$f":"COUNTIF(F324,\"yes\")","v":0},{"$f":"COUNTIF(F324,\"no\")","v":0},{"$f":"K324+L324","v":1},{"$f":"K324+M324","v":1},{"$f":"IF(D324>$I$4,InvalidAssessmentScore())","v":false}]
[323,null,null,null,{"$error":"#DIV/0!"},{"$error":"#DIV/0!"},"YES",null,null,null,1,0,0,1,1,{"$f":"IF(D325>$I$4,InvalidAssessmentScore())","v":false}]
[324,null,null,null,{"$error":"#DIV/0!"},{"$error":"#DIV/0!"},"YES",null,null,null,1,0,0,1,1,{"$f":"IF(D326>$I$4,InvalidAssessmentScore())","v":false}]
[325,null,null,null,{"$error":"#DIV/0!"},{"$error":"#DIV/0!"},"YES",null,null,null,1,0,0,1,1,{"$f":"IF(D327>$I$4,InvalidAssessmentScore())","v":false}]
[326,null,null,null,{"$error":"#DIV/0!"},{"$error":"#DIV/0!"},"YES",null,null,null,1,0,0,1,1,{"$f":"IF(D328>$I$4,InvalidAssessmentScore())","v":false}]
[327,null,null,null,{"$error":"#DIV/0!"},{"$error":"#DIV/0!"},"YES",null,null,null,1,0,0,1,1,{"$f":"IF(D329>$I$4,InvalidAssessmentScore())","v":false}]
[328,null,null,null,{"$error":"#DIV/0!"},{"$error":"#DIV/0!"},"YES",null,null,null,1,0,0,1,1,{"$f":"IF(D330>$I$4,InvalidAssessmentScore())","v":false}]
[329,null,null,null,{"$error":"#DIV/0!"},{"$error":"#DIV/0!"},"YES",null,null,null,1,0,0,1,1,{"$f":"IF(D331>$I$4,InvalidAssessmentScore())","v":false}]
[330,null,null,null,{"$error":"#DIV/0!"},{"$error":"#DIV/0!"},"YES",null,null,null,1,0,0,1,1,{"$f":"IF(D332>$I$4,InvalidAssessmentScore())","v":false}]
[331,null,null,null,{"$error":"#DIV/0!"},{"$error":"#DIV/0!"},"YES",null,null,null,1,0,0,1,1,{"$f":"IF(D333>$I$4,InvalidAssessmentScore())","v":false}]
[332,null,null,null,{"$error":"#DIV/0!"},{"$error":"#DIV/0!"},"YES",null,null,null,1,0,0,1,1,{"$f":"IF(D334>$I$4,InvalidAssessmentScore())","v":false}]
[333,null,null,null,{"$error":"#DIV/0!"},{"$error":"#DIV/0!"},"YES",null,null,null,1,0,0,1,1,{"$f":"IF(D335>$I$4,InvalidAssessmentScore())","v":false}]
[334,null,null,null,{"$error":"#DIV/0!"},{"$error":"#DIV/0!"},"YES",null,null,null,1,0,0,1,1,{"$f":"IF(D336>$I$4,InvalidAssessmentScore())","v":false}]
[335,null,null,null,{"$error":"#DIV/0!"},{"$error":"#DIV/0!"},"YES",null,null,null,1,0,0,1,1,{"$f":"IF(D337>$I$4,InvalidAssessmentScore())","v":false}]
[336,null,null,null,{"$error":"#DIV/0!"},{"$error":"#DIV/0!"},"YES",null,null,null,1,0,0,1,1,{"$f":"IF(D338>$I$4,InvalidAssessmentScore())","v":false}]
[337,null,null,null,{"$error":"#DIV/0!"},{"$error":"#DIV/0!"},"YES",null,null,null,1,0,0,1,1,{"$f":"IF(D339>$I$4,InvalidAssessmentScore())","v":false}]
[338,null,null,null,{"$error":"#DIV/0!"},{"$error":"#DIV/0!"},"YES",null,null,null,1,0,0,1,1,{"$f":"IF(D340>$I$4,InvalidAssessmentScore())","v":false}]
[339,null,null,null,{"$error":"#DIV/0!"},{"$error":"#DIV/0!"},"YES",null,null,null,1,0,0,1,1,{"$f":"IF(D341>$I$4,InvalidAssessmentScore())","v":false}]
[340,null,null,null,{"$error":"#DIV/0!"},{"$error":"#DIV/0!"},"YES",null,null,null,1,0,0,1,1,{"$f":"IF(D342>$I$4,InvalidAssessmentScore())","v":false}]
[341,null,null,null,{"$error":"#DIV/0!"},{"$error":"#DIV/0!"},"YES",null,null,null,1,0,0,1,1,{"$f":"IF(D343>$I$4,InvalidAssessmentScore())","v":false}]
[342,null,null,null,{"$error":"#DIV/0!"},{"$error":"#DIV/0!"},"YES",null,null,null,1,0,0,1,1,{"$f":"IF(D344>$I$4,InvalidAssessmentScore())","v":false}]
[343,null,null,null,{"$error":"#DIV/0!"},{"$error":"#DIV/0!"},"YES",null,null,null,1,0,0,1,1,{"$f":"IF(D345>$I$4,InvalidAssessmentScore())","v":false}]
[344,null,null,null,{"$error":"#DIV/0!"},{"$error":"#DIV/0!"},"YES",null,null,null,1,0,0,1,1,{"$f":"IF(D346>$I$4,InvalidAssessmentScore())","v":false}]
[345,null,null,null,{"$error":"#DIV/0!"},{"$error":"#DIV/0!"},"YES",null,null,null,1,0,0,1,1,{"$f":"IF(D347>$I$4,InvalidAssessmentScore())","v":false}]
[346,null,null,null,{"$error":"#DIV/0!"},{"$error":"#DIV/0!"},"YES",null,null,null,1,0,0,1,1,{"$f":"IF(D348>$I$4,InvalidAssessmentScore())","v":false}]
[347,null,null,null,{"$error":"#DIV/0!"},{"$error":"#DIV/0!"},"YES",null,null,null,1,0,0,1,1,{"$f":"IF(D349>$I$4,InvalidAssessmentScore())","v":false}]
[348,null,null,null,{"$error":"#DIV/0!"},{"$error":"#DIV/0!"},"YES",null,null,null,1,0,0,1,1,{"$f":"IF(D350>$I$4,InvalidAssessmentScore())","v":false}]
[349,null,null,null,{"$error":"#DIV/0!"},{"$error":"#DIV/0!"},"YES",null,null,null,1,0,0,1,1,{"$f":"IF(D351>$I$4,InvalidAssessmentScore())","v":false}]
[350,null,null,null,{"$error":"#DIV/0!"},{"$error":"#DIV/0!"},"YES",null,null,null,1,0,0,1,1,{"$f":"IF(D352>$I$4,InvalidAssessmentScore())","v":false}]
[]
[]
[]
[]
[]
[]
[]
[null,"After approval from your evaluator, please enter a brief explanation why."]
[null,"Last Name","First Name"]
[null,{"$f":"IF(G3=\"no\", B3, \"DELETE\")","v":"DELETE"},{"$f":"IF(G3=\"no\", C3,\"DELETE\")","v":"DELETE"}]
[null,{"$f":"IF(G4=\"no\", B4, \"DELETE\")","v":"DELETE"},"DELETE"]
[null,"DELETE","DELETE"]
[null,"DELETE","DELETE"]
[null,"DELETE","DELETE"]
[null,"DELETE","DELETE"]
[null,"DELETE","DELETE"]
[null,"DELETE","DELETE"]
[null,"DELETE","DELETE"]
[null,"DELETE","DELETE"]
[null,"DELETE","DELETE"]
[null,"DELETE","DELETE"]
[null,"DELETE","DELETE"]
[null,"DELETE","DELETE"]
[null,"DELETE","DELETE"]
[null,"DELETE","DELETE"]
[null,"DELETE","DELETE"]
[null,"DELETE","DELETE"]
[null,"DELETE","DELETE"]
[null,"DELETE","DELETE"]
[null,"DELETE","DELETE"]
[null,"DELETE","DELETE"]
[null,"DELETE","DELETE"]
[null,"DELETE","DELETE"]
[null,"DELETE","DELETE"]
[null,"DELETE","DELETE"]
[null,"DELETE","DELETE"]
[null,"DELETE","DELETE"]
[null,"DELETE","DELETE"]
[null,"DELETE","DELETE"]
[null,"DELETE","DELETE"]
[null,"DELETE","DELETE"]
[null,"DELETE",{"$f":"IF(G35=\"no\", C35,\"DELETE\")","v":"DELETE"}]
[null,"DELETE","DELETE"]
[null,"DELETE","DELETE"]
[null,"DELETE","DELETE"]
[null,"DELETE","DELETE"]
[null,"DELETE","DELETE"]
[null,"DELETE","DELETE"]
[null,"DELETE","DELETE"]
[null,"DELETE","DELETE"]
[null,"DELETE","DELETE"]
[null,"DELETE","DELETE"]
[null,"DELETE","DELETE"]
[null,"DELETE","DELETE"]
[null,"DELETE","DELETE"]
[null,"DELETE","DELETE"]
[null,"DELETE","DELETE"]
[null,"DELETE","DELETE"]
[null,"DELETE","DELETE"]
[null,"DELETE","DELETE"]
[null,"DELETE","DELETE"]
[null,"DELETE","DELETE"]
[null,"DELETE","DELETE"]
[null,"DELETE","DELETE"]
[null,"DELETE","DELETE"]
[null,"DELETE","DELETE"]
[null,"DELETE","DELETE"]
[null,"DELETE","DELETE"]
[null,"DELETE","DELETE"]
[null,"DELETE","DELETE"]
[null,"DELETE","DELETE"]
[null,"DELETE","DELETE"]
[null,"DELETE","DELETE"]
[null,"DELETE",{"$f":"IF(G67=\"no\", C67,\"DELETE\")","v":"DELETE"}]
[null,{"$f":"IF(G68=\"no\", B68, \"DELETE\")","v":"DELETE"},"DELETE"]
[null,"DELETE","DELETE"]
[null,"DELETE","DELETE"]
[null,"DELETE","DELETE"]
[null,"DELETE","DELETE"]
[null,"DELETE","DELETE"]
[null,"DELETE","DELETE"]
[null,"DELETE","DELETE"]
[null,"DELETE","DELETE"]
[null,"DELETE","DELETE"]
[null,"DELETE","DELETE"]
[null,"DELETE","DELETE"]
[null,"DELETE","DELETE"]
[null,"DELETE","DELETE"]
[null,"DELETE","DELETE"]
[null,"DELETE","DELETE"]
[null,"DELETE","DELETE"]
[null,"DELETE","DELETE"]
[null,"DELETE","DELETE"]
[null,"DELETE","DELETE"]
[null,"DELETE","DELETE"]
[null,"DELETE","DELETE"]
[null,"DELETE","DELETE"]
[null,"DELETE","DELETE"]
[null,"DELETE","DELETE"]
[null,"DELETE","DELETE"]
[null,"DELETE","DELETE"]
[null,"DELETE","DELETE"]
[null,"DELETE","DELETE"]
[null,"DELETE","DELETE"]
[null,"DELETE","DELETE"]
[null,"DELETE",{"$f":"IF(G99=\"no\", C99,\"DELETE\")","v":"DELETE"}]
[null,"DELETE","DELETE"]
[null,"DELETE","DELETE"]
[null,"DELETE","DELETE"]
[null,"DELETE","DELETE"]
[null,"DELETE","DELETE"]
[null,"DELETE","DELETE"]
[null,"DELETE","DELETE"]
[null,"DELETE","DELETE"]
[null,"DELETE","DELETE"]
[null,"DELETE","DELETE"]
[null,"DELETE","DELETE"]
[null,"DELETE","DELETE"]
[null,"DELETE","DELETE"]
[null,"DELETE","DELETE"]
[null,"DELETE","DELETE"]
[null,"DELETE","DELETE"]
[null,"DELETE","DELETE"]
[null,"DELETE","DELETE"]
[null,"DELETE","DELETE"]
[null,"DELETE","DELETE"]
[null,"DELETE","DELETE"]
[null,"DELETE","DELETE"]
[null,"DELETE","DELETE"]
[null,"DELETE","DELETE"]
[null,"DELETE","DELETE"]
[null,"DELETE","DELETE"]
[null,"DELETE","DELETE"]
[null,"DELETE","DELETE"]
[null,"DELETE","DELETE"]
[null,"DELETE","DELETE"]
[null,"DELETE","DELETE"]
[null,"DELETE",{"$f":"IF(G131=\"no\", C131,\"DELETE\")","v":"DELETE"}]
[null,{"$f":"IF(G132=\"no\", B132, \"DELETE\")","v":"DELETE"},"DELETE"]
[null,"DELETE","DELETE"]
[null,"DELETE","DELETE"]
[null,"DELETE","DELETE"]
[null,"DELETE","DELETE"]
[null,"DELETE","DELETE"]
[null,"DELETE","DELETE"]
[null,"DELETE","DELETE"]
[null,"DELETE","DELETE"]
[null,"DELETE","DELETE"]
[null,"DELETE","DELETE"]
[null,"DELETE","DELETE"]
[null,"DELETE","DELETE"]
[null,"DELETE","DELETE"]
[null,"DELETE","DELETE"]
[null,"DELETE","DELETE"]
[null,"DELETE","DELETE"]
[null,"DELETE","DELETE"]
[null,"DELETE","DELETE"]
[null,"DELETE","DELETE"]
[null,"DELETE","DELETE"]
[null,"DELETE","DELETE"]
[null,"DELETE","DELETE"]
[null,"DELETE","DELETE"]
[null,"DELETE","DELETE"]
[null,"DELETE","DELETE"]
[null,"DELETE","DELETE"]
[null,"DELETE","DELETE"]
[null,"DELETE","DELETE"]
[null,"DELETE","DELETE"]
[null,"DELETE","DELETE"]
[null,"DELETE",{"$f":"IF(G163=\"no\", C163,\"DELETE\")","v":"DELETE"}]
[null,"DELETE","DELETE"]
[null,"DELETE","DELETE"]
[null,"DELETE","DELETE"]
[null,"DELETE","DELETE"]
[null,"DELETE","DELETE"]
[null,"DELETE","DELETE"]
[null,"DELETE","DELETE"]
[null,"DELETE","DELETE"]
[null,"DELETE","DELETE"]
[null,"DELETE","DELETE"]
[null,"DELETE","DELETE"]
[null,"DELETE","DELETE"]
[null,"DELETE","DELETE"]
[null,"DELETE","DELETE"]
[null,"DELETE","DELETE"]
[null,"DELETE","DELETE"]
[null,"DELETE","DELETE"]
[null,"DELETE","DELETE"]
[null,"DELETE","DELETE"]
[null,"DELETE","DELETE"]
[null,"DELETE","DELETE"]
[null,"DELETE","DELETE"]
[null,"DELETE","DELETE"]
[null,"DELETE","DELETE"]
[null,"DELETE","DELETE"]
[null,"DELETE","DELETE"]
[null,"DELETE","DELETE"]
[null,"DELETE","DELETE"]
[null,"DELETE","DELETE"]
[null,"DELETE","DELETE"]
[null,"DELETE","DELETE"]
[null,"DELETE","DELETE"]
[null,{"$f":"IF(G196=\"no\", B196, \"DELETE\")","v":"DELETE"},"DELETE"]
[null,"DELETE","DELETE"]
[null,"DELETE","DELETE"]
[null,"DELETE","DELETE"]
[null,"DELETE","DELETE"]
[null,"DELETE","DELETE"]
[null,"DELETE","DELETE"]
[null,"DELETE","DELETE"]
[null,"DELETE","DELETE"]
[null,"DELETE","DELETE"]
[null,"DELETE","DELETE"]
[null,"DELETE","DELETE"]
[null,"DELETE","DELETE"]
[null,"DELETE","DELETE"]
[null,"DELETE","DELETE"]
[null,"DELETE","DELETE"]
[null,"DELETE","DELETE"]
[null,"DELETE","DELETE"]
[null,"DELETE","DELETE"]
[null,"DELETE","DELETE"]
[null,"DELETE","DELETE"]
[null,"DELETE","DELETE"]
[null,"DELETE","DELETE"]
[null,"DELETE","DELETE"]
[null,"DELETE","DELETE"]
[null,"DELETE","DELETE"]
[null,"DELETE","DELETE"]
[null,"DELETE","DELETE"]
[null,"DELETE","DELETE"]
[null,"DELETE","DELETE"]
[null,"DELETE","DELETE"]
[null,"DELETE",{"$f":"IF(G227=\"no\", C227,\"DELETE\")","v":"DELETE"}]
[null,"DELETE","DELETE"]
[null,"DELETE","DELETE"]
[null,"DELETE","DELETE"]
[null,"DELETE","DELETE"]
[null,"DELETE","DELETE"]
[null,"DELETE","DELETE"]
[null,"DELETE","DELETE"]
[null,"DELETE","DELETE"]
[null,"DELETE","DELETE"]
[null,"DELETE","DELETE"]
[null,"DELETE","DELETE"]
[null,"DELETE","DELETE"]
[null,"DELETE","DELETE"]
[null,"DELETE","DELETE"]
[null,"DELETE","DELETE"]
[null,"DELETE","DELETE"]
[null,"DELETE","DELETE"]
[null,"DELETE","DELETE"]
[null,"DELETE","DELETE"]
[null,"DELETE","DELETE"]
[null,"DELETE","DELETE"]
[null,"DELETE","DELETE"]
[null,"DELETE","DELETE"]
[null,"DELETE","DELETE"]
[null,"DELETE","DELETE"]
[null,"DELETE","DELETE"]
[null,"DELETE","DELETE"]
[null,"DELETE","DELETE"]
[null,"DELETE","DELETE"]
[null,"DELETE","DELETE"]
[null,"DELETE","DELETE"]
[null,"DELETE","DELETE"]
[null,{"$f":"IF(G260=\"no\", B260, \"DELETE\")","v":"DELETE"},"DELETE"]
[null,"DELETE","DELETE"]
[null,"DELETE","DELETE"]
[null,"DELETE","DELETE"]
[null,"DELETE","DELETE"]
[null,"DELETE","DELETE"]
[null,"DELETE","DELETE"]
[null,"DELETE","DELETE"]
[null,"DELETE","DELETE"]
[null,"DELETE","DELETE"]
[null,"DELETE","DELETE"]
[null,"DELETE","DELETE"]
[null,"DELETE","DELETE"]
[null,"DELETE","DELETE"]
[null,"DELETE","DELETE"]
[null,"DELETE","DELETE"]
[null,"DELETE","DELETE"]
[null,"DELETE","DELETE"]
[null,"DELETE","DELETE"]
[null,"DELETE","DELETE"]
[null,"DELETE","DELETE"]
[null,"DELETE","DELETE"]
[null,"DELETE","DELETE"]
[null,"DELETE","DELETE"]
[null,"DELETE","DELETE"]
[null,"DELETE","DELETE"]
[null,"DELETE","DELETE"]
[null,"DELETE","DELETE"]
[null,"DELETE","DELETE"]
[null,"DELETE","DELETE"]
[null,"DELETE","DELETE"]
[null,"DELETE",{"$f":"IF(G291=\"no\", C291,\"DELETE\")","v":"DELETE"}]
[null,"DELETE","DELETE"]
[null,"DELETE","DELETE"]
[null,"DELETE","DELETE"]
[null,"DELETE","DELETE"]
[null,"DELETE","DELETE"]
[null,"DELETE","DELETE"]
[null,"DELETE","DELETE"]
[null,"DELETE","DELETE"]
[null,"DELETE","DELETE"]
[null,"DELETE","DELETE"]
[null,"DELETE","DELETE"]
[null,"DELETE","DELETE"]
[null,"DELETE","DELETE"]
[null,"DELETE","DELETE"]
[null,"DELETE","DELETE"]
[null,"DELETE","DELETE"]
[null,"DELETE","DELETE"]
[null,"DELETE","DELETE"]
[null,"DELETE","DELETE"]
[null,"DELETE","DELETE"]
[null,"DELETE","DELETE"]
[null,"DELETE","DELETE"]
[null,"DELETE","DELETE"]
[null,"DELETE","DELETE"]
[null,"DELETE","DELETE"]
[null,"DELETE","DELETE"]
[null,"DELETE","DELETE"]
[null,"DELETE","DELETE"]
[null,"DELETE","DELETE"]
[null,"DELETE","DELETE"]
[null,"DELETE","DELETE"]
[null,"DELETE","DELETE"]
[null,{"$f":"IF(G324=\"no\", B324, \"DELETE\")","v":"DELETE"},"DELETE"]
[null,"DELETE","DELETE"]
[null,"DELETE","DELETE"]
[null,"DELETE","DELETE"]
[null,"DELETE","DELETE"]
[null,"DELETE","DELETE"]
[null,"DELETE","DELETE"]
[null,"DELETE","DELETE"]
[null,"DELETE","DELETE"]
[null,"DELETE","DELETE"]
[null,"DELETE","DELETE"]
[null,"DELETE","DELETE"]
[null,"DELETE","DELETE"]
[null,"DELETE","DELETE"]
[null,"DELETE","DELETE"]
[null,"DELETE","DELETE"]
[null,"DELETE","DELETE"]
[null,"DELETE","DELETE"]
[null,"DELETE","DELETE"]
[null,"DELETE","DELETE"]
[null,"DELETE","DELETE"]
[null,"DELETE","DELETE"]
[null,"DELETE","DELETE"]
[null,"DELETE","DELETE"]
[null,"DELETE","DELETE"]
[null,"DELETE","DELETE"]
[null,"DELETE","DELETE"]
[null,"DELETE","DELETE"]
[null,"DELETE","DELETE"]

{"sheet":"Sheet2","index":1,"n_rows":0,"n_cols":0,"rows_kept":0,"cut":false,"hidden":false,"merged":[]}

{"sheet":"Sheet3","index":2,"n_rows":0,"n_cols":0,"rows_kept":0,"cut":false,"hidden":false,"merged":[]}